MidnightBSD Magus

print/libgnomeprintmm

C++ bindings for the GNOME print support library

Flavor Version Run OSVersion Arch License Restricted Status
2.5.1_5 414 1.2 amd64 lgpl 0 fail

Events

Machine Type Time Message
m1264 fail 2020-07-06 18:15:49.613012 Test complete.
m1264 fail 2020-07-06 18:15:49.562543 make build returned non-zero: 1
m1264 info 2020-07-06 18:13:44.815813 Test Started

Log

===>  Building for libgnomeprintmm-2.5.1_5
gmake[1]: Entering directory '/magus/work/usr/mports/print/libgnomeprintmm/work/libgnomeprintmm-2.5.1'
Making all in tools
gmake[2]: Entering directory '/magus/work/usr/mports/print/libgnomeprintmm/work/libgnomeprintmm-2.5.1/tools'
Making all in extra_defs_gen
gmake[3]: Entering directory '/magus/work/usr/mports/print/libgnomeprintmm/work/libgnomeprintmm-2.5.1/tools/extra_defs_gen'
if c++ -DHAVE_CONFIG_H -I. -I. -I../../libgnomeprint -I/usr/local/include/pangomm-1.4 -I/usr/local/lib/pangomm-1.4/include -I/usr/local/include/glibmm-2.4 -I/usr/local/lib/glibmm-2.4/include -I/usr/local/include/glib-2.0 -I/usr/local/lib/glib-2.0/include -I/usr/local/include -I/usr/local/include/sigc++-2.0 -I/usr/local/lib/sigc++-2.0/include -I/usr/local/include/cairomm-1.0 -I/usr/local/lib/cairomm-1.0/include -I/usr/local/include/cairo -I/usr/local/include/pixman-1 -I/usr/local/include/freetype2 -I/usr/local/include/libdrm -I/usr/local/include/libpng16 -I/usr/local/include/pango-1.0 -I/usr/local/include/fribidi -D_THREAD_SAFE -I/usr/local/include/harfbuzz -I/usr/local/include/libgnomeprint-2.2 -I/usr/local/include/libart-2.0 -pthread -I/usr/local/include/libxml2     -O2 -pipe -fno-strict-aliasing  -MT generate_defs_libgnomeprint.o -MD -MP -MF ".deps/generate_defs_libgnomeprint.Tpo" -c -o generate_defs_libgnomeprint.o generate_defs_libgnomeprint.cc; \
then mv -f ".deps/generate_defs_libgnomeprint.Tpo" ".deps/generate_defs_libgnomeprint.Po"; else rm -f ".deps/generate_defs_libgnomeprint.Tpo"; exit 1; fi
In file included from generate_defs_libgnomeprint.cc:22:
/usr/local/include/glibmm-2.4/glibmm_generate_extra_defs/generate_extra_defs.h:26:29: warning: alias declarations are a C++11 extension [-Wc++11-extensions]
using GTypeIsAPointerFunc = bool(*)(GType gtype);
                            ^
1 warning generated.
/bin/sh ../../libtool --mode=link c++  -O2 -pipe -fno-strict-aliasing    -o generate_extra_defs  generate_defs_libgnomeprint.o  -L/usr/local/lib -lpangomm-1.4 -lglibmm-2.4 -lcairomm-1.0 -lsigc-2.0 -lpangocairo-1.0 -lcairo -lpthread -lgnomeprint-2-2 -lz -lart_lgpl_2 -lgmodule-2.0 -pthread -lglib-2.0 -lxml2 -lpango-1.0 -lgobject-2.0 -lglib-2.0 -lintl  -L/usr/local/lib/glibmm-2.4/proc/../.. -lglibmm_generate_extra_defs-2.4
mkdir .libs
c++ -O2 -pipe -fno-strict-aliasing -o generate_extra_defs generate_defs_libgnomeprint.o  -L/usr/local/lib -lpangomm-1.4 -lglibmm-2.4 -lcairomm-1.0 -lsigc-2.0 -lpangocairo-1.0 -lcairo -lpthread /usr/local/lib/libgnomeprint-2-2.so -lz -lart_lgpl_2 -lgmodule-2.0 -pthread -lxml2 -lpango-1.0 -lgobject-2.0 -lglib-2.0 -lintl -L/usr/local/lib/glibmm-2.4/proc/../.. -lglibmm_generate_extra_defs-2.4 -Wl,--rpath -Wl,/usr/local/lib -Wl,--rpath -Wl,/usr/local/lib
gmake[3]: Leaving directory '/magus/work/usr/mports/print/libgnomeprintmm/work/libgnomeprintmm-2.5.1/tools/extra_defs_gen'
Making all in m4
gmake[3]: Entering directory '/magus/work/usr/mports/print/libgnomeprintmm/work/libgnomeprintmm-2.5.1/tools/m4'
gmake[3]: Nothing to be done for 'all'.
gmake[3]: Leaving directory '/magus/work/usr/mports/print/libgnomeprintmm/work/libgnomeprintmm-2.5.1/tools/m4'
gmake[3]: Entering directory '/magus/work/usr/mports/print/libgnomeprintmm/work/libgnomeprintmm-2.5.1/tools'
gmake[3]: Nothing to be done for 'all-am'.
gmake[3]: Leaving directory '/magus/work/usr/mports/print/libgnomeprintmm/work/libgnomeprintmm-2.5.1/tools'
gmake[2]: Leaving directory '/magus/work/usr/mports/print/libgnomeprintmm/work/libgnomeprintmm-2.5.1/tools'
Making all in libgnomeprint
gmake[2]: Entering directory '/magus/work/usr/mports/print/libgnomeprintmm/work/libgnomeprintmm-2.5.1/libgnomeprint'
gmake  all-recursive
gmake[3]: Entering directory '/magus/work/usr/mports/print/libgnomeprintmm/work/libgnomeprintmm-2.5.1/libgnomeprint'
Making all in src
gmake[4]: Entering directory '/magus/work/usr/mports/print/libgnomeprintmm/work/libgnomeprintmm-2.5.1/libgnomeprint/src'
gmake[4]: Nothing to be done for 'all'.
gmake[4]: Leaving directory '/magus/work/usr/mports/print/libgnomeprintmm/work/libgnomeprintmm-2.5.1/libgnomeprint/src'
Making all in libgnomeprintmm
gmake[4]: Entering directory '/magus/work/usr/mports/print/libgnomeprintmm/work/libgnomeprintmm-2.5.1/libgnomeprint/libgnomeprintmm'
Making all in private
gmake[5]: Entering directory '/magus/work/usr/mports/print/libgnomeprintmm/work/libgnomeprintmm-2.5.1/libgnomeprint/libgnomeprintmm/private'
gmake[5]: Nothing to be done for 'all'.
gmake[5]: Leaving directory '/magus/work/usr/mports/print/libgnomeprintmm/work/libgnomeprintmm-2.5.1/libgnomeprint/libgnomeprintmm/private'
gmake[5]: Entering directory '/magus/work/usr/mports/print/libgnomeprintmm/work/libgnomeprintmm-2.5.1/libgnomeprint/libgnomeprintmm'
if /bin/sh ../../libtool --mode=compile c++ -DHAVE_CONFIG_H -DG_LOG_DOMAIN=\"libgnomeprintmm\"  -I../../libgnomeprint -I../../libgnomeprint -I/usr/local/include/pangomm-1.4 -I/usr/local/lib/pangomm-1.4/include -I/usr/local/include/glibmm-2.4 -I/usr/local/lib/glibmm-2.4/include -I/usr/local/include/glib-2.0 -I/usr/local/lib/glib-2.0/include -I/usr/local/include -I/usr/local/include/sigc++-2.0 -I/usr/local/lib/sigc++-2.0/include -I/usr/local/include/cairomm-1.0 -I/usr/local/lib/cairomm-1.0/include -I/usr/local/include/cairo -I/usr/local/include/pixman-1 -I/usr/local/include/freetype2 -I/usr/local/include/libdrm -I/usr/local/include/libpng16 -I/usr/local/include/pango-1.0 -I/usr/local/include/fribidi -D_THREAD_SAFE -I/usr/local/include/harfbuzz -I/usr/local/include/libgnomeprint-2.2 -I/usr/local/include/libart-2.0 -pthread -I/usr/local/include/libxml2    -O2 -pipe -fno-strict-aliasing  -MT enums.lo -MD -MP -MF ".deps/enums.Tpo" -c -o enums.lo enums.cc; \
then mv -f ".deps/enums.Tpo" ".deps/enums.Plo"; else rm -f ".deps/enums.Tpo"; exit 1; fi
if /bin/sh ../../libtool --mode=compile c++ -DHAVE_CONFIG_H -DG_LOG_DOMAIN=\"libgnomeprintmm\"  -I../../libgnomeprint -I../../libgnomeprint -I/usr/local/include/pangomm-1.4 -I/usr/local/lib/pangomm-1.4/include -I/usr/local/include/glibmm-2.4 -I/usr/local/lib/glibmm-2.4/include -I/usr/local/include/glib-2.0 -I/usr/local/lib/glib-2.0/include -I/usr/local/include -I/usr/local/include/sigc++-2.0 -I/usr/local/lib/sigc++-2.0/include -I/usr/local/include/cairomm-1.0 -I/usr/local/lib/cairomm-1.0/include -I/usr/local/include/cairo -I/usr/local/include/pixman-1 -I/usr/local/include/freetype2 -I/usr/local/include/libdrm -I/usr/local/include/libpng16 -I/usr/local/include/pango-1.0 -I/usr/local/include/fribidi -D_THREAD_SAFE -I/usr/local/include/harfbuzz -I/usr/local/include/libgnomeprint-2.2 -I/usr/local/include/libart-2.0 -pthread -I/usr/local/include/libxml2    -O2 -pipe -fno-strict-aliasing  -MT config.lo -MD -MP -MF ".deps/config.Tpo" -c -o config.lo config.cc; \
then mv -f ".deps/config.Tpo" ".deps/config.Plo"; else rm -f ".deps/config.Tpo"; exit 1; fi
if /bin/sh ../../libtool --mode=compile c++ -DHAVE_CONFIG_H -DG_LOG_DOMAIN=\"libgnomeprintmm\"  -I../../libgnomeprint -I../../libgnomeprint -I/usr/local/include/pangomm-1.4 -I/usr/local/lib/pangomm-1.4/include -I/usr/local/include/glibmm-2.4 -I/usr/local/lib/glibmm-2.4/include -I/usr/local/include/glib-2.0 -I/usr/local/lib/glib-2.0/include -I/usr/local/include -I/usr/local/include/sigc++-2.0 -I/usr/local/lib/sigc++-2.0/include -I/usr/local/include/cairomm-1.0 -I/usr/local/lib/cairomm-1.0/include -I/usr/local/include/cairo -I/usr/local/include/pixman-1 -I/usr/local/include/freetype2 -I/usr/local/include/libdrm -I/usr/local/include/libpng16 -I/usr/local/include/pango-1.0 -I/usr/local/include/fribidi -D_THREAD_SAFE -I/usr/local/include/harfbuzz -I/usr/local/include/libgnomeprint-2.2 -I/usr/local/include/libart-2.0 -pthread -I/usr/local/include/libxml2    -O2 -pipe -fno-strict-aliasing  -MT context.lo -MD -MP -MF ".deps/context.Tpo" -c -o context.lo context.cc; \
then mv -f ".deps/context.Tpo" ".deps/context.Plo"; else rm -f ".deps/context.Tpo"; exit 1; fi
if /bin/sh ../../libtool --mode=compile c++ -DHAVE_CONFIG_H -DG_LOG_DOMAIN=\"libgnomeprintmm\"  -I../../libgnomeprint -I../../libgnomeprint -I/usr/local/include/pangomm-1.4 -I/usr/local/lib/pangomm-1.4/include -I/usr/local/include/glibmm-2.4 -I/usr/local/lib/glibmm-2.4/include -I/usr/local/include/glib-2.0 -I/usr/local/lib/glib-2.0/include -I/usr/local/include -I/usr/local/include/sigc++-2.0 -I/usr/local/lib/sigc++-2.0/include -I/usr/local/include/cairomm-1.0 -I/usr/local/lib/cairomm-1.0/include -I/usr/local/include/cairo -I/usr/local/include/pixman-1 -I/usr/local/include/freetype2 -I/usr/local/include/libdrm -I/usr/local/include/libpng16 -I/usr/local/include/pango-1.0 -I/usr/local/include/fribidi -D_THREAD_SAFE -I/usr/local/include/harfbuzz -I/usr/local/include/libgnomeprint-2.2 -I/usr/local/include/libart-2.0 -pthread -I/usr/local/include/libxml2    -O2 -pipe -fno-strict-aliasing  -MT font.lo -MD -MP -MF ".deps/font.Tpo" -c -o font.lo font.cc; \
then mv -f ".deps/font.Tpo" ".deps/font.Plo"; else rm -f ".deps/font.Tpo"; exit 1; fi
if /bin/sh ../../libtool --mode=compile c++ -DHAVE_CONFIG_H -DG_LOG_DOMAIN=\"libgnomeprintmm\"  -I../../libgnomeprint -I../../libgnomeprint -I/usr/local/include/pangomm-1.4 -I/usr/local/lib/pangomm-1.4/include -I/usr/local/include/glibmm-2.4 -I/usr/local/lib/glibmm-2.4/include -I/usr/local/include/glib-2.0 -I/usr/local/lib/glib-2.0/include -I/usr/local/include -I/usr/local/include/sigc++-2.0 -I/usr/local/lib/sigc++-2.0/include -I/usr/local/include/cairomm-1.0 -I/usr/local/lib/cairomm-1.0/include -I/usr/local/include/cairo -I/usr/local/include/pixman-1 -I/usr/local/include/freetype2 -I/usr/local/include/libdrm -I/usr/local/include/libpng16 -I/usr/local/include/pango-1.0 -I/usr/local/include/fribidi -D_THREAD_SAFE -I/usr/local/include/harfbuzz -I/usr/local/include/libgnomeprint-2.2 -I/usr/local/include/libart-2.0 -pthread -I/usr/local/include/libxml2    -O2 -pipe -fno-strict-aliasing  -MT job.lo -MD -MP -MF ".deps/job.Tpo" -c -o job.lo job.cc; \
then mv -f ".deps/job.Tpo" ".deps/job.Plo"; else rm -f ".deps/job.Tpo"; exit 1; fi
if /bin/sh ../../libtool --mode=compile c++ -DHAVE_CONFIG_H -DG_LOG_DOMAIN=\"libgnomeprintmm\"  -I../../libgnomeprint -I../../libgnomeprint -I/usr/local/include/pangomm-1.4 -I/usr/local/lib/pangomm-1.4/include -I/usr/local/include/glibmm-2.4 -I/usr/local/lib/glibmm-2.4/include -I/usr/local/include/glib-2.0 -I/usr/local/lib/glib-2.0/include -I/usr/local/include -I/usr/local/include/sigc++-2.0 -I/usr/local/lib/sigc++-2.0/include -I/usr/local/include/cairomm-1.0 -I/usr/local/lib/cairomm-1.0/include -I/usr/local/include/cairo -I/usr/local/include/pixman-1 -I/usr/local/include/freetype2 -I/usr/local/include/libdrm -I/usr/local/include/libpng16 -I/usr/local/include/pango-1.0 -I/usr/local/include/fribidi -D_THREAD_SAFE -I/usr/local/include/harfbuzz -I/usr/local/include/libgnomeprint-2.2 -I/usr/local/include/libart-2.0 -pthread -I/usr/local/include/libxml2    -O2 -pipe -fno-strict-aliasing  -MT wrap_init.lo -MD -MP -MF ".deps/wrap_init.Tpo" -c -o wrap_init.lo wrap_init.cc; \
then mv -f ".deps/wrap_init.Tpo" ".deps/wrap_init.Plo"; else rm -f ".deps/wrap_init.Tpo"; exit 1; fi
if /bin/sh ../../libtool --mode=compile c++ -DHAVE_CONFIG_H -DG_LOG_DOMAIN=\"libgnomeprintmm\"  -I../../libgnomeprint -I../../libgnomeprint -I/usr/local/include/pangomm-1.4 -I/usr/local/lib/pangomm-1.4/include -I/usr/local/include/glibmm-2.4 -I/usr/local/lib/glibmm-2.4/include -I/usr/local/include/glib-2.0 -I/usr/local/lib/glib-2.0/include -I/usr/local/include -I/usr/local/include/sigc++-2.0 -I/usr/local/lib/sigc++-2.0/include -I/usr/local/include/cairomm-1.0 -I/usr/local/lib/cairomm-1.0/include -I/usr/local/include/cairo -I/usr/local/include/pixman-1 -I/usr/local/include/freetype2 -I/usr/local/include/libdrm -I/usr/local/include/libpng16 -I/usr/local/include/pango-1.0 -I/usr/local/include/fribidi -D_THREAD_SAFE -I/usr/local/include/harfbuzz -I/usr/local/include/libgnomeprint-2.2 -I/usr/local/include/libart-2.0 -pthread -I/usr/local/include/libxml2    -O2 -pipe -fno-strict-aliasing  -MT init.lo -MD -MP -MF ".deps/init.Tpo" -c -o init.lo init.cc; \
then mv -f ".deps/init.Tpo" ".deps/init.Plo"; else rm -f ".deps/init.Tpo"; exit 1; fi
if /bin/sh ../../libtool --mode=compile c++ -DHAVE_CONFIG_H -DG_LOG_DOMAIN=\"libgnomeprintmm\"  -I../../libgnomeprint -I../../libgnomeprint -I/usr/local/include/pangomm-1.4 -I/usr/local/lib/pangomm-1.4/include -I/usr/local/include/glibmm-2.4 -I/usr/local/lib/glibmm-2.4/include -I/usr/local/include/glib-2.0 -I/usr/local/lib/glib-2.0/include -I/usr/local/include -I/usr/local/include/sigc++-2.0 -I/usr/local/lib/sigc++-2.0/include -I/usr/local/include/cairomm-1.0 -I/usr/local/lib/cairomm-1.0/include -I/usr/local/include/cairo -I/usr/local/include/pixman-1 -I/usr/local/include/freetype2 -I/usr/local/include/libdrm -I/usr/local/include/libpng16 -I/usr/local/include/pango-1.0 -I/usr/local/include/fribidi -D_THREAD_SAFE -I/usr/local/include/harfbuzz -I/usr/local/include/libgnomeprint-2.2 -I/usr/local/include/libart-2.0 -pthread -I/usr/local/include/libxml2    -O2 -pipe -fno-strict-aliasing  -MT private.lo -MD -MP -MF ".deps/private.Tpo" -c -o private.lo private.cc; \
then mv -f ".deps/private.Tpo" ".deps/private.Plo"; else rm -f ".deps/private.Tpo"; exit 1; fi
mkdir .libs
 c++ -DHAVE_CONFIG_H -DG_LOG_DOMAIN=\"libgnomeprintmm\" -I../../libgnomeprint -I../../libgnomeprint -I/usr/local/include/pangomm-1.4 -I/usr/local/lib/pangomm-1.4/include -I/usr/local/include/glibmm-2.4 -I/usr/local/lib/glibmm-2.4/include -I/usr/local/include/glib-2.0 -I/usr/local/lib/glib-2.0/include -I/usr/local/include -I/usr/local/include/sigc++-2.0 -I/usr/local/lib/sigc++-2.0/include -I/usr/local/include/cairomm-1.0 -I/usr/local/lib/cairomm-1.0/include -I/usr/local/include/cairo -I/usr/local/include/pixman-1 -I/usr/local/include/freetype2 -I/usr/local/include/libdrm -I/usr/local/include/libpng16 -I/usr/local/include/pango-1.0 -I/usr/local/include/fribidi -D_THREAD_SAFE -I/usr/local/include/harfbuzz -I/usr/local/include/libgnomeprint-2.2 -I/usr/local/include/libart-2.0 -pthread -I/usr/local/include/libxml2 -O2 -pipe -fno-strict-aliasing -MT config.lo -MD -MP -MF .deps/config.Tpo -c config.cc  -fPIC -DPIC -o .libs/config.o
 c++ -DHAVE_CONFIG_H -DG_LOG_DOMAIN=\"libgnomeprintmm\" -I../../libgnomeprint -I../../libgnomeprint -I/usr/local/include/pangomm-1.4 -I/usr/local/lib/pangomm-1.4/include -I/usr/local/include/glibmm-2.4 -I/usr/local/lib/glibmm-2.4/include -I/usr/local/include/glib-2.0 -I/usr/local/lib/glib-2.0/include -I/usr/local/include -I/usr/local/include/sigc++-2.0 -I/usr/local/lib/sigc++-2.0/include -I/usr/local/include/cairomm-1.0 -I/usr/local/lib/cairomm-1.0/include -I/usr/local/include/cairo -I/usr/local/include/pixman-1 -I/usr/local/include/freetype2 -I/usr/local/include/libdrm -I/usr/local/include/libpng16 -I/usr/local/include/pango-1.0 -I/usr/local/include/fribidi -D_THREAD_SAFE -I/usr/local/include/harfbuzz -I/usr/local/include/libgnomeprint-2.2 -I/usr/local/include/libart-2.0 -pthread -I/usr/local/include/libxml2 -O2 -pipe -fno-strict-aliasing -MT init.lo -MD -MP -MF .deps/init.Tpo -c init.cc  -fPIC -DPIC -o .libs/init.o
 c++ -DHAVE_CONFIG_H -DG_LOG_DOMAIN=\"libgnomeprintmm\" -I../../libgnomeprint -I../../libgnomeprint -I/usr/local/include/pangomm-1.4 -I/usr/local/lib/pangomm-1.4/include -I/usr/local/include/glibmm-2.4 -I/usr/local/lib/glibmm-2.4/include -I/usr/local/include/glib-2.0 -I/usr/local/lib/glib-2.0/include -I/usr/local/include -I/usr/local/include/sigc++-2.0 -I/usr/local/lib/sigc++-2.0/include -I/usr/local/include/cairomm-1.0 -I/usr/local/lib/cairomm-1.0/include -I/usr/local/include/cairo -I/usr/local/include/pixman-1 -I/usr/local/include/freetype2 -I/usr/local/include/libdrm -I/usr/local/include/libpng16 -I/usr/local/include/pango-1.0 -I/usr/local/include/fribidi -D_THREAD_SAFE -I/usr/local/include/harfbuzz -I/usr/local/include/libgnomeprint-2.2 -I/usr/local/include/libart-2.0 -pthread -I/usr/local/include/libxml2 -O2 -pipe -fno-strict-aliasing -MT job.lo -MD -MP -MF .deps/job.Tpo -c job.cc  -fPIC -DPIC -o .libs/job.o
 c++ -DHAVE_CONFIG_H -DG_LOG_DOMAIN=\"libgnomeprintmm\" -I../../libgnomeprint -I../../libgnomeprint -I/usr/local/include/pangomm-1.4 -I/usr/local/lib/pangomm-1.4/include -I/usr/local/include/glibmm-2.4 -I/usr/local/lib/glibmm-2.4/include -I/usr/local/include/glib-2.0 -I/usr/local/lib/glib-2.0/include -I/usr/local/include -I/usr/local/include/sigc++-2.0 -I/usr/local/lib/sigc++-2.0/include -I/usr/local/include/cairomm-1.0 -I/usr/local/lib/cairomm-1.0/include -I/usr/local/include/cairo -I/usr/local/include/pixman-1 -I/usr/local/include/freetype2 -I/usr/local/include/libdrm -I/usr/local/include/libpng16 -I/usr/local/include/pango-1.0 -I/usr/local/include/fribidi -D_THREAD_SAFE -I/usr/local/include/harfbuzz -I/usr/local/include/libgnomeprint-2.2 -I/usr/local/include/libart-2.0 -pthread -I/usr/local/include/libxml2 -O2 -pipe -fno-strict-aliasing -MT wrap_init.lo -MD -MP -MF .deps/wrap_init.Tpo -c wrap_init.cc  -fPIC -DPIC -o .libs/wrap_init.o
 c++ -DHAVE_CONFIG_H -DG_LOG_DOMAIN=\"libgnomeprintmm\" -I../../libgnomeprint -I../../libgnomeprint -I/usr/local/include/pangomm-1.4 -I/usr/local/lib/pangomm-1.4/include -I/usr/local/include/glibmm-2.4 -I/usr/local/lib/glibmm-2.4/include -I/usr/local/include/glib-2.0 -I/usr/local/lib/glib-2.0/include -I/usr/local/include -I/usr/local/include/sigc++-2.0 -I/usr/local/lib/sigc++-2.0/include -I/usr/local/include/cairomm-1.0 -I/usr/local/lib/cairomm-1.0/include -I/usr/local/include/cairo -I/usr/local/include/pixman-1 -I/usr/local/include/freetype2 -I/usr/local/include/libdrm -I/usr/local/include/libpng16 -I/usr/local/include/pango-1.0 -I/usr/local/include/fribidi -D_THREAD_SAFE -I/usr/local/include/harfbuzz -I/usr/local/include/libgnomeprint-2.2 -I/usr/local/include/libart-2.0 -pthread -I/usr/local/include/libxml2 -O2 -pipe -fno-strict-aliasing -MT enums.lo -MD -MP -MF .deps/enums.Tpo -c enums.cc  -fPIC -DPIC -o .libs/enums.o
 c++ -DHAVE_CONFIG_H -DG_LOG_DOMAIN=\"libgnomeprintmm\" -I../../libgnomeprint -I../../libgnomeprint -I/usr/local/include/pangomm-1.4 -I/usr/local/lib/pangomm-1.4/include -I/usr/local/include/glibmm-2.4 -I/usr/local/lib/glibmm-2.4/include -I/usr/local/include/glib-2.0 -I/usr/local/lib/glib-2.0/include -I/usr/local/include -I/usr/local/include/sigc++-2.0 -I/usr/local/lib/sigc++-2.0/include -I/usr/local/include/cairomm-1.0 -I/usr/local/lib/cairomm-1.0/include -I/usr/local/include/cairo -I/usr/local/include/pixman-1 -I/usr/local/include/freetype2 -I/usr/local/include/libdrm -I/usr/local/include/libpng16 -I/usr/local/include/pango-1.0 -I/usr/local/include/fribidi -D_THREAD_SAFE -I/usr/local/include/harfbuzz -I/usr/local/include/libgnomeprint-2.2 -I/usr/local/include/libart-2.0 -pthread -I/usr/local/include/libxml2 -O2 -pipe -fno-strict-aliasing -MT private.lo -MD -MP -MF .deps/private.Tpo -c private.cc  -fPIC -DPIC -o .libs/private.o
 c++ -DHAVE_CONFIG_H -DG_LOG_DOMAIN=\"libgnomeprintmm\" -I../../libgnomeprint -I../../libgnomeprint -I/usr/local/include/pangomm-1.4 -I/usr/local/lib/pangomm-1.4/include -I/usr/local/include/glibmm-2.4 -I/usr/local/lib/glibmm-2.4/include -I/usr/local/include/glib-2.0 -I/usr/local/lib/glib-2.0/include -I/usr/local/include -I/usr/local/include/sigc++-2.0 -I/usr/local/lib/sigc++-2.0/include -I/usr/local/include/cairomm-1.0 -I/usr/local/lib/cairomm-1.0/include -I/usr/local/include/cairo -I/usr/local/include/pixman-1 -I/usr/local/include/freetype2 -I/usr/local/include/libdrm -I/usr/local/include/libpng16 -I/usr/local/include/pango-1.0 -I/usr/local/include/fribidi -D_THREAD_SAFE -I/usr/local/include/harfbuzz -I/usr/local/include/libgnomeprint-2.2 -I/usr/local/include/libart-2.0 -pthread -I/usr/local/include/libxml2 -O2 -pipe -fno-strict-aliasing -MT font.lo -MD -MP -MF .deps/font.Tpo -c font.cc  -fPIC -DPIC -o .libs/font.o
 c++ -DHAVE_CONFIG_H -DG_LOG_DOMAIN=\"libgnomeprintmm\" -I../../libgnomeprint -I../../libgnomeprint -I/usr/local/include/pangomm-1.4 -I/usr/local/lib/pangomm-1.4/include -I/usr/local/include/glibmm-2.4 -I/usr/local/lib/glibmm-2.4/include -I/usr/local/include/glib-2.0 -I/usr/local/lib/glib-2.0/include -I/usr/local/include -I/usr/local/include/sigc++-2.0 -I/usr/local/lib/sigc++-2.0/include -I/usr/local/include/cairomm-1.0 -I/usr/local/lib/cairomm-1.0/include -I/usr/local/include/cairo -I/usr/local/include/pixman-1 -I/usr/local/include/freetype2 -I/usr/local/include/libdrm -I/usr/local/include/libpng16 -I/usr/local/include/pango-1.0 -I/usr/local/include/fribidi -D_THREAD_SAFE -I/usr/local/include/harfbuzz -I/usr/local/include/libgnomeprint-2.2 -I/usr/local/include/libart-2.0 -pthread -I/usr/local/include/libxml2 -O2 -pipe -fno-strict-aliasing -MT context.lo -MD -MP -MF .deps/context.Tpo -c context.cc  -fPIC -DPIC -o .libs/context.o
 c++ -DHAVE_CONFIG_H -DG_LOG_DOMAIN=\"libgnomeprintmm\" -I../../libgnomeprint -I../../libgnomeprint -I/usr/local/include/pangomm-1.4 -I/usr/local/lib/pangomm-1.4/include -I/usr/local/include/glibmm-2.4 -I/usr/local/lib/glibmm-2.4/include -I/usr/local/include/glib-2.0 -I/usr/local/lib/glib-2.0/include -I/usr/local/include -I/usr/local/include/sigc++-2.0 -I/usr/local/lib/sigc++-2.0/include -I/usr/local/include/cairomm-1.0 -I/usr/local/lib/cairomm-1.0/include -I/usr/local/include/cairo -I/usr/local/include/pixman-1 -I/usr/local/include/freetype2 -I/usr/local/include/libdrm -I/usr/local/include/libpng16 -I/usr/local/include/pango-1.0 -I/usr/local/include/fribidi -D_THREAD_SAFE -I/usr/local/include/harfbuzz -I/usr/local/include/libgnomeprint-2.2 -I/usr/local/include/libart-2.0 -pthread -I/usr/local/include/libxml2 -O2 -pipe -fno-strict-aliasing -MT init.lo -MD -MP -MF .deps/init.Tpo -c init.cc -o init.o >/dev/null 2>&1
In file included from context.cc:3:
In file included from ../../libgnomeprint/libgnomeprintmm/context.h:6:
In file included from /usr/local/include/glibmm-2.4/glibmm.h:88:
In file included from /usr/local/include/glibmm-2.4/glibmm/thread.h:47:
In file included from /usr/local/include/glibmm-2.4/glibmm/error.h:22:
In file included from /usr/local/include/glibmm-2.4/glibmm/exception.h:22:
/usr/local/include/glibmm-2.4/glibmm/ustring.h:101:29: warning: alias declarations are a C++11 extension [-Wc++11-extensions]
  using iterator_category = std::bidirectional_iterator_tag;
                            ^
/usr/local/include/glibmm-2.4/glibmm/ustring.h:102:22: warning: alias declarations are a C++11 extension [-Wc++11-extensions]
  using value_type = gunichar;
                     ^
/usr/local/include/glibmm-2.4/glibmm/ustring.h:103:27: warning: alias declarations are a C++11 extension [-Wc++11-extensions]
  using difference_type = std::string::difference_type;
                          ^
/usr/local/include/glibmm-2.4/glibmm/ustring.h:104:21: warning: alias declarations are a C++11 extension [-Wc++11-extensions]
  using reference = value_type;
                    ^
/usr/local/include/glibmm-2.4/glibmm/ustring.h:105:19: warning: alias declarations are a C++11 extension [-Wc++11-extensions]
  using pointer = void;
                  ^
/usr/local/include/glibmm-2.4/glibmm/ustring.h:216:21: warning: alias declarations are a C++11 extension [-Wc++11-extensions]
  using size_type = std::string::size_type;
                    ^
/usr/local/include/glibmm-2.4/glibmm/ustring.h:217:27: warning: alias declarations are a C++11 extension [-Wc++11-extensions]
  using difference_type = std::string::difference_type;
                          ^
/usr/local/include/glibmm-2.4/glibmm/ustring.h:219:22: warning: alias declarations are a C++11 extension [-Wc++11-extensions]
  using value_type = gunichar;
                     ^
/usr/local/include/glibmm-2.4/glibmm/ustring.h:220:21: warning: alias declarations are a C++11 extension [-Wc++11-extensions]
  using reference = gunichar&;
                    ^
/usr/local/include/glibmm-2.4/glibmm/ustring.h:221:27: warning: alias declarations are a C++11 extension [-Wc++11-extensions]
  using const_reference = const gunichar&;
                          ^
/usr/local/include/glibmm-2.4/glibmm/ustring.h:223:20: warning: alias declarations are a C++11 extension [-Wc++11-extensions]
  using iterator = ustring_Iterator;
                   ^
/usr/local/include/glibmm-2.4/glibmm/ustring.h:224:26: warning: alias declarations are a C++11 extension [-Wc++11-extensions]
  using const_iterator = ustring_Iterator;
                         ^
/usr/local/include/glibmm-2.4/glibmm/ustring.h:228:28: warning: alias declarations are a C++11 extension [-Wc++11-extensions]
  using reverse_iterator = std::reverse_iterator;
                           ^
/usr/local/include/glibmm-2.4/glibmm/ustring.h:229:34: warning: alias declarations are a C++11 extension [-Wc++11-extensions]
  using const_reverse_iterator = std::reverse_iterator;
                                 ^
/usr/local/include/glibmm-2.4/glibmm/ustring.h:255:13: error: expected ';' at end of declaration list
  ~ustring() noexcept;
            ^
            ;
/usr/local/include/glibmm-2.4/glibmm/ustring.h:265:18: warning: rvalue references are a C++11 extension [-Wc++11-extensions]
  ustring(ustring&& other);
                 ^
/usr/local/include/glibmm-2.4/glibmm/ustring.h:275:29: warning: rvalue references are a C++11 extension [-Wc++11-extensions]
  ustring& operator=(ustring&& other);
                            ^
/usr/local/include/glibmm-2.4/glibmm/ustring.h:290:22: warning: rvalue references are a C++11 extension [-Wc++11-extensions]
  ustring(std::string&& src);
                     ^
/usr/local/include/glibmm-2.4/glibmm/ustring.h:333:33: warning: rvalue references are a C++11 extension [-Wc++11-extensions]
  ustring& operator=(std::string&& src);
                                ^
/usr/local/include/glibmm-2.4/glibmm/ustring.h:339:26: warning: rvalue references are a C++11 extension [-Wc++11-extensions]
  ustring& assign(ustring&& src);
                         ^
/usr/local/include/glibmm-2.4/glibmm/ustring.h:870:48: warning: deleted function definitions are a C++11 extension [-Wc++11-extensions]
  FormatStream(const ustring::FormatStream&) = delete;
                                               ^
/usr/local/include/glibmm-2.4/glibmm/ustring.h:871:59: warning: deleted function definitions are a C++11 extension [-Wc++11-extensions]
  FormatStream& operator=(const ustring::FormatStream&) = delete;
                                                          ^
/usr/local/include/glibmm-2.4/glibmm/ustring.h:875:22: warning: alias declarations are a C++11 extension [-Wc++11-extensions]
  using StreamType = std::wostringstream;
                     ^
/usr/local/include/glibmm-2.4/glibmm/ustring.h:883:18: error: expected ';' at end of declaration list
  ~FormatStream() noexcept;
                 ^
                 ;
/usr/local/include/glibmm-2.4/glibmm/ustring.h:1269:45: warning: deleted function definitions are a C++11 extension [-Wc++11-extensions]
  Stringify(const ustring::Stringify&) = delete;
                                            ^
/usr/local/include/glibmm-2.4/glibmm/ustring.h:1270:59: warning: deleted function definitions are a C++11 extension [-Wc++11-extensions]
  Stringify& operator=(const ustring::Stringify&) = delete;
                                                          ^
/usr/local/include/glibmm-2.4/glibmm/ustring.h:1286:51: warning: deleted function definitions are a C++11 extension [-Wc++11-extensions]
  Stringify(const ustring::Stringify&) = delete;
                                                  ^
/usr/local/include/glibmm-2.4/glibmm/ustring.h:1287:71: warning: deleted function definitions are a C++11 extension [-Wc++11-extensions]
  Stringify& operator=(const ustring::Stringify&) = delete;
                                                                      ^
/usr/local/include/glibmm-2.4/glibmm/ustring.h:1305:55: warning: deleted function definitions are a C++11 extension [-Wc++11-extensions]
  Stringify(const ustring::Stringify&) = delete;
                                                      ^
/usr/local/include/glibmm-2.4/glibmm/ustring.h:1306:75: warning: deleted function definitions are a C++11 extension [-Wc++11-extensions]
  Stringify& operator=(const ustring::Stringify&) = delete;
                                                                          ^
/usr/local/include/glibmm-2.4/glibmm/ustring.h:1324:51: warning: deleted function definitions are a C++11 extension [-Wc++11-extensions]
  Stringify(const ustring::Stringify&) = delete;
                                                  ^
/usr/local/include/glibmm-2.4/glibmm/ustring.h:1325:71: warning: deleted function definitions are a C++11 extension [-Wc++11-extensions]
  Stringify& operator=(const ustring::Stringify&) = delete;
                                                                      ^
/usr/local/include/glibmm-2.4/glibmm/ustring.h:1344:57: warning: deleted function definitions are a C++11 extension [-Wc++11-extensions]
  Stringify(const ustring::Stringify&) = delete;
                                                        ^
/usr/local/include/glibmm-2.4/glibmm/ustring.h:1345:77: warning: deleted function definitions are a C++11 extension [-Wc++11-extensions]
  Stringify& operator=(const ustring::Stringify&) = delete;
                                                                            ^
/usr/local/include/glibmm-2.4/glibmm/ustring.h:1643:48: warning: deleted function definitions are a C++11 extension [-Wc++11-extensions]
bool operator==(const ustring& lhs, int rhs) = delete;
                                               ^
/usr/local/include/glibmm-2.4/glibmm/ustring.h:1644:48: warning: deleted function definitions are a C++11 extension [-Wc++11-extensions]
bool operator==(int lhs, const ustring& rhs) = delete;
                                               ^
/usr/local/include/glibmm-2.4/glibmm/ustring.h:1645:48: warning: deleted function definitions are a C++11 extension [-Wc++11-extensions]
bool operator!=(const ustring& lhs, int rhs) = delete;
                                               ^
/usr/local/include/glibmm-2.4/glibmm/ustring.h:1646:48: warning: deleted function definitions are a C++11 extension [-Wc++11-extensions]
bool operator!=(int lhs, const ustring& rhs) = delete;
                                               ^
/usr/local/include/glibmm-2.4/glibmm/ustring.h:1647:47: warning: deleted function definitions are a C++11 extension [-Wc++11-extensions]
bool operator<(const ustring& lhs, int rhs) = delete;
                                              ^
/usr/local/include/glibmm-2.4/glibmm/ustring.h:1648:47: warning: deleted function definitions are a C++11 extension [-Wc++11-extensions]
bool operator<(int lhs, const ustring& rhs) = delete;
                                              ^
/usr/local/include/glibmm-2.4/glibmm/ustring.h:1649:47: warning: deleted function definitions are a C++11 extension [-Wc++11-extensions]
bool operator>(const ustring& lhs, int rhs) = delete;
                                              ^
/usr/local/include/glibmm-2.4/glibmm/ustring.h:1650:47: warning: deleted function definitions are a C++11 extension [-Wc++11-extensions]
bool operator>(int lhs, const ustring& rhs) = delete;
                                              ^
/usr/local/include/glibmm-2.4/glibmm/ustring.h:1651:48: warning: deleted function definitions are a C++11 extension [-Wc++11-extensions]
bool operator<=(const ustring& lhs, int rhs) = delete;
                                               ^
/usr/local/include/glibmm-2.4/glibmm/ustring.h:1652:48: warning: deleted function definitions are a C++11 extension [-Wc++11-extensions]
bool operator<=(int lhs, const ustring& rhs) = delete;
                                               ^
/usr/local/include/glibmm-2.4/glibmm/ustring.h:1653:48: warning: deleted function definitions are a C++11 extension [-Wc++11-extensions]
bool operator>=(const ustring& lhs, int rhs) = delete;
                                               ^
/usr/local/include/glibmm-2.4/glibmm/ustring.h:1654:48: warning: deleted function definitions are a C++11 extension [-Wc++11-extensions]
bool operator>=(int lhs, const ustring& rhs) = delete;
                                               ^
In file included from context.cc:3:
In file included from ../../libgnomeprint/libgnomeprintmm/context.h:6:
In file included from /usr/local/include/glibmm-2.4/glibmm.h:88:
In file included from /usr/local/include/glibmm-2.4/glibmm/thread.h:47:
In file included from /usr/local/include/glibmm-2.4/glibmm/error.h:22:
/usr/local/include/glibmm-2.4/glibmm/exception.h:30:23: error: expected ';' at end of declaration list
  virtual ~Exception() noexcept = 0;
                      ^
                      ;
In file included from context.cc:3:
In file included from ../../libgnomeprint/libgnomeprintmm/context.h:6:
In file included from /usr/local/include/glibmm-2.4/glibmm.h:88:
In file included from /usr/local/include/glibmm-2.4/glibmm/thread.h:47:
/usr/local/include/glibmm-2.4/glibmm/error.h:38:11: error: expected ';' at end of declaration list
  ~Error() noexcept override;
          ^
          ;
/usr/local/include/glibmm-2.4/glibmm/error.h:42:30: warning: 'override' keyword is a C++11 extension [-Wc++11-extensions]
  Glib::ustring what() const override;
                             ^
/usr/local/include/glibmm-2.4/glibmm/error.h:53:21: warning: alias declarations are a C++11 extension [-Wc++11-extensions]
  using ThrowFunc = void(*)(GError*);
                    ^
In file included from context.cc:3:
In file included from ../../libgnomeprint/libgnomeprintmm/context.h:6:
In file included from /usr/local/include/glibmm-2.4/glibmm.h:88:
In file included from /usr/local/include/glibmm-2.4/glibmm/thread.h:49:
In file included from /usr/local/include/sigc++-2.0/sigc++/sigc++.h:104:
In file included from /usr/local/include/sigc++-2.0/sigc++/signal.h:8:
In file included from /usr/local/include/sigc++-2.0/sigc++/signal_base.h:25:
/usr/local/include/sigc++-2.0/sigc++/type_traits.h:63:27: warning: alias declarations are a C++11 extension [-Wc++11-extensions]
using type_trait_pass_t = typename type_trait::pass;
                          ^
/usr/local/include/sigc++-2.0/sigc++/type_traits.h:66:27: warning: alias declarations are a C++11 extension [-Wc++11-extensions]
using type_trait_take_t = typename type_trait::take;
                          ^
In file included from context.cc:3:
In file included from ../../libgnomeprint/libgnomeprintmm/context.h:6:
In file included from /usr/local/include/glibmm-2.4/glibmm.h:88:
In file included from /usr/local/include/glibmm-2.4/glibmm/thread.h:49:
In file included from /usr/local/include/sigc++-2.0/sigc++/sigc++.h:104:
In file included from /usr/local/include/sigc++-2.0/sigc++/signal.h:8:
In file included from /usr/local/include/sigc++-2.0/sigc++/signal_base.h:26:
/usr/local/include/sigc++-2.0/sigc++/trackable.h:40:59: error: expected ';' at end of declaration list
  trackable_callback(void* data, func_destroy_notify func) noexcept
                                                          ^
                                                          ;
/usr/local/include/sigc++-2.0/sigc++/trackable.h:71:65: warning: deleted function definitions are a C++11 extension [-Wc++11-extensions]
  trackable_callback_list(const trackable_callback_list& src) = delete;
                                                                ^
/usr/local/include/sigc++-2.0/sigc++/trackable.h:72:76: warning: deleted function definitions are a C++11 extension [-Wc++11-extensions]
  trackable_callback_list& operator=(const trackable_callback_list& src) = delete;
                                                                           ^
/usr/local/include/sigc++-2.0/sigc++/trackable.h:73:50: warning: rvalue references are a C++11 extension [-Wc++11-extensions]
  trackable_callback_list(trackable_callback_list&& src) = delete;
                                                 ^
/usr/local/include/sigc++-2.0/sigc++/trackable.h:73:60: warning: deleted function definitions are a C++11 extension [-Wc++11-extensions]
  trackable_callback_list(trackable_callback_list&& src) = delete;
                                                           ^
/usr/local/include/sigc++-2.0/sigc++/trackable.h:74:61: warning: rvalue references are a C++11 extension [-Wc++11-extensions]
  trackable_callback_list& operator=(trackable_callback_list&& src) = delete;
                                                            ^
/usr/local/include/sigc++-2.0/sigc++/trackable.h:74:71: warning: deleted function definitions are a C++11 extension [-Wc++11-extensions]
  trackable_callback_list& operator=(trackable_callback_list&& src) = delete;
                                                                      ^
/usr/local/include/sigc++-2.0/sigc++/trackable.h:116:14: error: expected ';' at end of declaration list
  trackable() noexcept;
             ^
             ;
/usr/local/include/sigc++-2.0/sigc++/trackable.h:118:34: error: expected ';' at end of declaration list
  trackable(const trackable& src) noexcept;
                                 ^
                                 ;
/usr/local/include/sigc++-2.0/sigc++/trackable.h:120:22: warning: rvalue references are a C++11 extension [-Wc++11-extensions]
  trackable(trackable&& src);
                     ^
/usr/local/include/sigc++-2.0/sigc++/trackable.h:124:33: warning: rvalue references are a C++11 extension [-Wc++11-extensions]
  trackable& operator=(trackable&& src);
                                ^
In file included from private.cc:18:
In file included from ../../libgnomeprint/libgnomeprintmm/private.h:22:
In file included from /usr/local/include/glibmm-2.4/glibmm.h:88:
In file included from /usr/local/include/glibmm-2.4/glibmm/thread.h:47:
In file included from /usr/local/include/glibmm-2.4/glibmm/error.h:22:
In file included from /usr/local/include/glibmm-2.4/glibmm/exception.h:22:
/usr/local/include/glibmm-2.4/glibmm/ustring.h:101:29: warning: alias declarations are a C++11 extension [-Wc++11-extensions]
  using iterator_category = std::bidirectional_iterator_tag;
                            ^
/usr/local/include/glibmm-2.4/glibmm/ustring.h:102:22: warning: alias declarations are a C++11 extension [-Wc++11-extensions]
  using value_type = gunichar;
                     ^
/usr/local/include/glibmm-2.4/glibmm/ustring.h:103:27: warning: alias declarations are a C++11 extension [-Wc++11-extensions]
  using difference_type = std::string::difference_type;
                          ^
/usr/local/include/glibmm-2.4/glibmm/ustring.h:104:21: warning: alias declarations are a C++11 extension [-Wc++11-extensions]
  using reference = value_type;
                    ^
In file included from config.cc:3:
In file included from ../../libgnomeprint/libgnomeprintmm/config.h:6:
In file included from /usr/local/include/glibmm-2.4/glibmm.h:88:
/usr/local/include/glibmm-2.4/glibmm/ustring.h:105:19: warning: alias declarations are a C++11 extension [-Wc++11-extensions]
In file included from /usr/local/include/glibmm-2.4/glibmm/thread.h:47:
In file included from /usr/local/include/glibmm-2.4/glibmm/error.h:22:
In file included from /usr/local/include/glibmm-2.4/glibmm/exception.h:22:
/usr/local/include/glibmm-2.4/glibmm/ustring.h:101:29: warning: alias declarations are a C++11 extension [-Wc++11-extensions]
  using pointer = void;
                  ^
  using iterator_category = std::bidirectional_iterator_tag;
                            ^
/usr/local/include/glibmm-2.4/glibmm/ustring.h:102:22: warning: alias declarations are a C++11 extension [-Wc++11-extensions]
  using value_type = gunichar;
                     ^
/usr/local/include/glibmm-2.4/glibmm/ustring.h:103:27: warning: alias declarations are a C++11 extension [-Wc++11-extensions]
/usr/local/include/glibmm-2.4/glibmm/ustring.h:216:21: warning: alias declarations are a C++11 extension [-Wc++11-extensions]
  using difference_type = std::string::difference_type;
                          ^
  using size_type = std::string::size_type;
/usr/local/include/glibmm-2.4/glibmm/ustring.h:104:21: warning: alias declarations are a C++11 extension [-Wc++11-extensions]
                    ^
  using reference = value_type;
                    ^/usr/local/include/glibmm-2.4/glibmm/ustring.h:217:27: warning: alias declarations are a C++11 extension [-Wc++11-extensions]

  using difference_type = std::string::difference_type;
                          ^
/usr/local/include/glibmm-2.4/glibmm/ustring.h:105:19: warning: alias declarations are a C++11 extension [-Wc++11-extensions]
/usr/local/include/glibmm-2.4/glibmm/ustring.h  using pointer = void;
                  ^
:219:22: warning: alias declarations are a C++11 extension [-Wc++11-extensions]
  using value_type = gunichar;
                     ^
/usr/local/include/glibmm-2.4/glibmm/ustring.h:220:21: warning: alias declarations are a C++11 extension [-Wc++11-extensions]
/usr/local/include/glibmm-2.4/glibmm/ustring.h  using reference = gunichar&;
                    ^
:/usr/local/include/glibmm-2.4/glibmm/ustring.h:221:27: warning: alias declarations are a C++11 extension [-Wc++11-extensions]
216:21: warning: alias declarations are a C++11 extension [-Wc++11-extensions]
  using const_reference = const gunichar&;
                          ^
  using size_type = std::string::size_type;
                    ^
/usr/local/include/glibmm-2.4/glibmm/ustring.h:223:20: warning: alias declarations are a C++11 extension [-Wc++11-extensions]
/usr/local/include/glibmm-2.4/glibmm/ustring.h:217:27: warning: alias declarations are a C++11 extension [-Wc++11-extensions]
  using iterator = ustring_Iterator;
                   ^
  using difference_type = std::string::difference_type;
                          ^
/usr/local/include/glibmm-2.4/glibmm/ustring.h:224:26: warning: alias declarations are a C++11 extension [-Wc++11-extensions]
/usr/local/include/glibmm-2.4/glibmm/ustring.h:219:22: warning: alias declarations are a C++11 extension [-Wc++11-extensions]
  using const_iterator = ustring_Iterator;  using value_type = gunichar;
                     ^

/usr/local/include/glibmm-2.4/glibmm/ustring.h:220:21: warning: alias declarations are a C++11 extension [-Wc++11-extensions]
                         ^  using reference = gunichar&;
                    ^

/usr/local/include/glibmm-2.4/glibmm/ustring.h:221:27: warning: alias declarations are a C++11 extension [-Wc++11-extensions]
/usr/local/include/glibmm-2.4/glibmm/ustring.h:228:28: warning: alias declarations are a C++11 extension [-Wc++11-extensions]
  using const_reference = const gunichar&;
                          ^
  using reverse_iterator = std::reverse_iterator;
                           ^
/usr/local/include/glibmm-2.4/glibmm/ustring.h:223:20: warning: alias declarations are a C++11 extension [-Wc++11-extensions]
/usr/local/include/glibmm-2.4/glibmm/ustring.h:229:34: warning: alias declarations are a C++11 extension [-Wc++11-extensions]
  using iterator = ustring_Iterator;
                   ^
  using const_reverse_iterator = std::reverse_iterator;
                                 ^
/usr/local/include/glibmm-2.4/glibmm/ustring.h:224:26: warning: alias declarations are a C++11 extension [-Wc++11-extensions]
/usr/local/include/glibmm-2.4/glibmm/ustring.h:  using const_iterator = ustring_Iterator;255:13: error: expected ';' at end of declaration list

  ~ustring() noexcept;
            ^
            ;
                         ^
/usr/local/include/glibmm-2.4/glibmm/ustring.h:265:18: warning: rvalue references are a C++11 extension [-Wc++11-extensions]
/usr/local/include/glibmm-2.4/glibmm/ustring.h  ustring(ustring&& other);
                 ^
:228:28:/usr/local/include/glibmm-2.4/glibmm/ustring.h:275:29: warning: rvalue references are a C++11 extension [-Wc++11-extensions]
  ustring& operator=(ustring&& other);
                            ^ 
warning: alias declarations are a C++11 extension [-Wc++11-extensions]
/usr/local/include/glibmm-2.4/glibmm/ustring.h:290:22: warning: rvalue references are a C++11 extension [-Wc++11-extensions]
  using reverse_iterator = std::reverse_iterator;  ustring(std::string&& src);
                     ^

                           ^
/usr/local/include/glibmm-2.4/glibmm/ustring.h:229:34: warning: alias declarations are a C++11 extension [-Wc++11-extensions]
/usr/local/include/glibmm-2.4/glibmm/ustring.h:  using const_reverse_iterator = std::reverse_iterator;333
:                                 ^33
: warning: rvalue references are a C++11 extension [-Wc++11-extensions]
  ustring& operator=(std::string&& src);
                                ^
/usr/local/include/glibmm-2.4/glibmm/ustring.h:255:13: error: expected ';' at end of declaration list/usr/local/include/glibmm-2.4/glibmm/ustring.h
:339  ~ustring() noexcept;:
26            ^:
             ;warning
: rvalue references are a C++11 extension [-Wc++11-extensions]
/usr/local/include/glibmm-2.4/glibmm/ustring.h  ustring& assign(ustring&& src);:
265                         ^:
18: warning: rvalue references are a C++11 extension [-Wc++11-extensions]
  ustring(ustring&& other);
                 ^
/usr/local/include/glibmm-2.4/glibmm/ustring.h:275:29: warning: rvalue references are a C++11 extension [-Wc++11-extensions]
  ustring& operator=(ustring&& other);
                            ^
/usr/local/include/glibmm-2.4/glibmm/ustring.h:290:22: warning: rvalue references are a C++11 extension [-Wc++11-extensions]
  ustring(std::string&& src);
                     ^
/usr/local/include/glibmm-2.4/glibmm/ustring.h:333:33: warning: rvalue references are a C++11 extension [-Wc++11-extensions]
  ustring& operator=(std::string&& src);
                                ^
/usr/local/include/glibmm-2.4/glibmm/ustring.h:339:26: warning: rvalue references are a C++11 extension [-Wc++11-extensions]
  ustring& assign(ustring&& src);
                         ^
/usr/local/include/glibmm-2.4/glibmm/ustring.h:870:48: warning: deleted function definitions are a C++11 extension [-Wc++11-extensions]
  FormatStream(const ustring::FormatStream&) = delete;
                                               ^
/usr/local/include/glibmm-2.4/glibmm/ustring.h:871:59: warning: deleted function definitions are a C++11 extension [-Wc++11-extensions]
  FormatStream& operator=(const ustring::FormatStream&) = delete;
                                                          ^
/usr/local/include/glibmm-2.4/glibmm/ustring.h:875:22: warning: alias declarations are a C++11 extension [-Wc++11-extensions]
  using StreamType = std::wostringstream;
                     ^
/usr/local/include/glibmm-2.4/glibmm/ustring.h:883:18: error: expected ';' at end of declaration list
  ~FormatStream() noexcept;
                 ^
                 ;
/usr/local/include/glibmm-2.4/glibmm/ustring.h:870:48: warning: deleted function definitions are a C++11 extension [-Wc++11-extensions]
  FormatStream(const ustring::FormatStream&) = delete;
                                               ^
/usr/local/include/glibmm-2.4/glibmm/ustring.h:871:59: warning: deleted function definitions are a C++11 extension [-Wc++11-extensions]
  FormatStream& operator=(const ustring::FormatStream&) = delete;
                                                          ^
/usr/local/include/glibmm-2.4/glibmm/ustring.h:875:22: warning: alias declarations are a C++11 extension [-Wc++11-extensions]
  using StreamType = std::wostringstream;
                     ^
/usr/local/include/glibmm-2.4/glibmm/ustring.h:883:18: error: expected ';' at end of declaration list
  ~FormatStream() noexcept;
                 ^
                 ;
/usr/local/include/glibmm-2.4/glibmm/ustring.h:1269:45: warning: deleted function definitions are a C++11 extension [-Wc++11-extensions]
  Stringify(const ustring::Stringify&) = delete;
                                            ^
/usr/local/include/glibmm-2.4/glibmm/ustring.h:1270:59: warning: deleted function definitions are a C++11 extension [-Wc++11-extensions]
  Stringify& operator=(const ustring::Stringify&) = delete;
                                                          ^
/usr/local/include/glibmm-2.4/glibmm/ustring.h:1286:51: warning: deleted function definitions are a C++11 extension [-Wc++11-extensions]
  Stringify(const ustring::Stringify&) = delete;
                                                  ^
/usr/local/include/glibmm-2.4/glibmm/ustring.h:1287:71: warning: deleted function definitions are a C++11 extension [-Wc++11-extensions]
  Stringify& operator=(const ustring::Stringify&) = delete;
                                                                      ^
/usr/local/include/glibmm-2.4/glibmm/ustring.h:1305:55: warning: deleted function definitions are a C++11 extension [-Wc++11-extensions]
  Stringify(const ustring::Stringify&) = delete;
                                                      ^
/usr/local/include/glibmm-2.4/glibmm/ustring.h:1306:75: warning: deleted function definitions are a C++11 extension [-Wc++11-extensions]
  Stringify& operator=(const ustring::Stringify&) = delete;
                                                                          ^
/usr/local/include/glibmm-2.4/glibmm/ustring.h:1269:45: warning: deleted function definitions are a C++11 extension [-Wc++11-extensions]
/usr/local/include/glibmm-2.4/glibmm/ustring.h:1324:51: warning: deleted function definitions are a C++11 extension [-Wc++11-extensions]
  Stringify(const ustring::Stringify&) = delete;
                                            ^
  Stringify(const ustring::Stringify&) = delete;
                                                  ^
/usr/local/include/glibmm-2.4/glibmm/ustring.h:1270:59: warning: deleted function definitions are a C++11 extension [-Wc++11-extensions]
/usr/local/include/glibmm-2.4/glibmm/ustring.h:1325:71: warning: deleted function definitions are a C++11 extension [-Wc++11-extensions]
  Stringify& operator=(const ustring::Stringify&) = delete;
                                                          ^
  Stringify& operator=(const ustring::Stringify&) = delete;
                                                                      ^
/usr/local/include/glibmm-2.4/glibmm/ustring.h/usr/local/include/glibmm-2.4/glibmm/ustring.h:1344:57: warning: deleted function definitions are a C++11 extension [-Wc++11-extensions]
:1286:51: warning: deleted function definitions are a C++11 extension [-Wc++11-extensions]
  Stringify(const ustring::Stringify&) = delete;
                                                        ^
  Stringify(const ustring::Stringify&) = delete;
                                                  ^
/usr/local/include/glibmm-2.4/glibmm/ustring.h:1345:77: warning: deleted function definitions are a C++11 extension [-Wc++11-extensions]
/usr/local/include/glibmm-2.4/glibmm/ustring.h:1287:71: warning: deleted function definitions are a C++11 extension [-Wc++11-extensions]
  Stringify& operator=(const ustring::Stringify&) = delete;
                                                                            ^
  Stringify& operator=(const ustring::Stringify&) = delete;
                                                                      ^
/usr/local/include/glibmm-2.4/glibmm/ustring.h:1305:55: warning: deleted function definitions are a C++11 extension [-Wc++11-extensions]
  Stringify(const ustring::Stringify&) = delete;
                                                      ^
/usr/local/include/glibmm-2.4/glibmm/ustring.h:1306:75: warning: deleted function definitions are a C++11 extension [-Wc++11-extensions]
  Stringify& operator=(const ustring::Stringify&) = delete;
                                                                          ^
/usr/local/include/glibmm-2.4/glibmm/ustring.h:1324:51: warning: deleted function definitions are a C++11 extension [-Wc++11-extensions]
  Stringify(const ustring::Stringify&) = delete;
                                                  ^
/usr/local/include/glibmm-2.4/glibmm/ustring.h:1325:71: warning: deleted function definitions are a C++11 extension [-Wc++11-extensions]
  Stringify& operator=(const ustring::Stringify&) = delete;
                                                                      ^
/usr/local/include/glibmm-2.4/glibmm/ustring.h:1344:57: warning: deleted function definitions are a C++11 extension [-Wc++11-extensions]
  Stringify(const ustring::Stringify&) = delete;
                                                        ^
/usr/local/include/glibmm-2.4/glibmm/ustring.h:1345:77: warning: deleted function definitions are a C++11 extension [-Wc++11-extensions]
  Stringify& operator=(const ustring::Stringify&) = delete;
                                                                            ^
/usr/local/include/glibmm-2.4/glibmm/ustring.h:1643:48: warning: deleted function definitions are a C++11 extension [-Wc++11-extensions]
bool operator==(const ustring& lhs, int rhs) = delete;
                                               ^
/usr/local/include/glibmm-2.4/glibmm/ustring.h:1644:48: warning: deleted function definitions are a C++11 extension [-Wc++11-extensions]
bool operator==(int lhs, const ustring& rhs) = delete;
                                               ^
/usr/local/include/glibmm-2.4/glibmm/ustring.h:1645:48: warning: deleted function definitions are a C++11 extension [-Wc++11-extensions]
bool operator!=(const ustring& lhs, int rhs) = delete;
                                               ^
/usr/local/include/glibmm-2.4/glibmm/ustring.h:1646:48: warning: deleted function definitions are a C++11 extension [-Wc++11-extensions]
bool operator!=(int lhs, const ustring& rhs) = delete;
                                               ^
/usr/local/include/glibmm-2.4/glibmm/ustring.h:1647:47: warning: deleted function definitions are a C++11 extension [-Wc++11-extensions]
bool operator<(const ustring& lhs, int rhs) = delete;
                                              ^
/usr/local/include/glibmm-2.4/glibmm/ustring.h:1648:47: warning: deleted function definitions are a C++11 extension [-Wc++11-extensions]
bool operator<(int lhs, const ustring& rhs) = delete;
                                              ^
/usr/local/include/glibmm-2.4/glibmm/ustring.h:1649:47: warning: deleted function definitions are a C++11 extension [-Wc++11-extensions]
bool operator>(const ustring& lhs, int rhs) = delete;
                                              ^
/usr/local/include/glibmm-2.4/glibmm/ustring.h:1650:47: warning: deleted function definitions are a C++11 extension [-Wc++11-extensions]
bool operator>(int lhs, const ustring& rhs) = delete;
                                              ^
/usr/local/include/glibmm-2.4/glibmm/ustring.h:1651:48: warning: deleted function definitions are a C++11 extension [-Wc++11-extensions]
bool operator<=(const ustring& lhs, int rhs) = delete;
                                               ^
/usr/local/include/glibmm-2.4/glibmm/ustring.h:1652:48: warning: deleted function definitions are a C++11 extension [-Wc++11-extensions]
bool operator<=(int lhs, const ustring& rhs) = delete;
                                               ^
/usr/local/include/glibmm-2.4/glibmm/ustring.h:1643:48: warning: deleted function definitions are a C++11 extension [-Wc++11-extensions]
/usr/local/include/glibmm-2.4/glibmm/ustring.h:1653:48: warning: deleted function definitions are a C++11 extension [-Wc++11-extensions]
bool operator==(const ustring& lhs, int rhs) = delete;
                                               ^
bool operator>=(const ustring& lhs, int rhs) = delete;
                                               ^
/usr/local/include/glibmm-2.4/glibmm/ustring.h:1644:48: warning: deleted function definitions are a C++11 extension [-Wc++11-extensions]
/usr/local/include/glibmm-2.4/glibmm/ustring.h:1654:48: warning: deleted function definitions are a C++11 extension [-Wc++11-extensions]
bool operator==(int lhs, const ustring& rhs) = delete;
                                               ^
bool operator>=(int lhs, const ustring& rhs) = delete;
                                               ^
/usr/local/include/glibmm-2.4/glibmm/ustring.h:1645:48: warning: deleted function definitions are a C++11 extension [-Wc++11-extensions]
bool operator!=(const ustring& lhs, int rhs) = delete;
                                               ^
/usr/local/include/glibmm-2.4/glibmm/ustring.h:1646:48: warning: deleted function definitions are a C++11 extension [-Wc++11-extensions]
bool operator!=(int lhs, const ustring& rhs) = delete;
                                               ^
/usr/local/include/glibmm-2.4/glibmm/ustring.h:1647:47: warning: deleted function definitions are a C++11 extension [-Wc++11-extensions]
In file included from bool operator<(const ustring& lhs, int rhs) = delete;
                                              ^
wrap_init.cc:10:
In file included from /usr/local/include/glibmm-2.4/glibmm/error.h:22:
In file included from /usr/local/include/glibmm-2.4/glibmm/exception.h:22:
/usr/local/include/glibmm-2.4/glibmm/ustring.h:101:29: warning: alias declarations are a C++11 extension [-Wc++11-extensions]
/usr/local/include/glibmm-2.4/glibmm/ustring.h:1648:47: warning: deleted function definitions are a C++11 extension [-Wc++11-extensions]
In file included from private.cc:bool operator<(int lhs, const ustring& rhs) = delete;18
:
In file included from                                               ^
../../libgnomeprint/libgnomeprintmm/private.h:22:
/usr/local/include/glibmm-2.4/glibmm/ustring.hIn file included from /usr/local/include/glibmm-2.4/glibmm.h::88:
1649In file included from /usr/local/include/glibmm-2.4/glibmm/thread.h:47:
:47:  using iterator_category = std::bidirectional_iterator_tag; In file included from warning/usr/local/include/glibmm-2.4/glibmm/error.h: :deleted function definitions are a C++11 extension [-Wc++11-extensions]

                            ^
22:
/usr/local/include/glibmm-2.4/glibmm/exception.hbool operator>(const ustring& lhs, int rhs) = delete;:30:23: 
error:                                               ^expected ';' at end of declaration list

  virtual ~Exception() noexcept = 0;
                      ^
                      ;
/usr/local/include/glibmm-2.4/glibmm/ustring.h:1650:47: warning: In file included from private.cc:18:
In file included from /usr/local/include/glibmm-2.4/glibmm/ustring.h../../libgnomeprint/libgnomeprintmm/private.h:22:
:102deleted function definitions are a C++11 extension [-Wc++11-extensions]:
22: warning: alias declarations are a C++11 extension [-Wc++11-extensions]
bool operator>(int lhs, const ustring& rhs) = delete;  using value_type = gunichar;
In file included from                      ^/usr/local/include/glibmm-2.4/glibmm.h
:88/usr/local/include/glibmm-2.4/glibmm/ustring.h:
:In file included from 103/usr/local/include/glibmm-2.4/glibmm/thread.h
                                              ^
:47:
/usr/local/include/glibmm-2.4/glibmm/error.h:38:11/usr/local/include/glibmm-2.4/glibmm/ustring.h: :1651:48:error : warning: expected ';' at end of declaration list
deleted function definitions are a C++11 extension [-Wc++11-extensions]  ~Error() noexcept override;
          ^
          ;
:
/usr/local/include/glibmm-2.4/glibmm/error.h:42:30: warning: 'override' keyword is a C++11 extension [-Wc++11-extensions]
27bool operator<=(const ustring& lhs, int rhs) = delete;
                                               ^:  Glib::ustring what() const override; 
warning: alias declarations are a C++11 extension [-Wc++11-extensions]/usr/local/include/glibmm-2.4/glibmm/ustring.h
:1652:48:
 warning:   using difference_type = std::string::difference_type;
deleted function definitions are a C++11 extension [-Wc++11-extensions]
                          ^
                             ^bool operator<=(int lhs, const ustring& rhs) = delete;
/usr/local/include/glibmm-2.4/glibmm/ustring.h                                               ^:
104:21:/usr/local/include/glibmm-2.4/glibmm/ustring.h
 :warning1653: :alias declarations are a C++11 extension [-Wc++11-extensions]
48:  using reference = value_type;/usr/local/include/glibmm-2.4/glibmm/error.h warning
:                     ^deleted function definitions are a C++11 extension [-Wc++11-extensions]:

53/usr/local/include/glibmm-2.4/glibmm/ustring.h::21bool operator>=(const ustring& lhs, int rhs) = delete;105:
:                                                ^19warning
::  alias declarations are a C++11 extension [-Wc++11-extensions]warning
/usr/local/include/glibmm-2.4/glibmm/ustring.h:   using ThrowFunc = void(*)(GError*);:alias declarations are a C++11 extension [-Wc++11-extensions]
1654
                    ^:
  using pointer = void;48
:                  ^ 
warning: deleted function definitions are a C++11 extension [-Wc++11-extensions]
bool operator>=(int lhs, const ustring& rhs) = delete;
                                               ^
/usr/local/include/glibmm-2.4/glibmm/ustring.h:216:21: warning: alias declarations are a C++11 extension [-Wc++11-extensions]
  using size_type = std::string::size_type;
                    ^
/usr/local/include/glibmm-2.4/glibmm/ustring.h:217:27: warning: alias declarations are a C++11 extension [-Wc++11-extensions]
  using difference_type = std::string::difference_type;
                          ^
/usr/local/include/glibmm-2.4/glibmm/ustring.h:219:22: warning: alias declarations are a C++11 extension [-Wc++11-extensions]
  using value_type = gunichar;
                     ^
/usr/local/include/glibmm-2.4/glibmm/ustring.h:220:21: warning: alias declarations are a C++11 extension [-Wc++11-extensions]
  using reference = gunichar&;
                    ^
/usr/local/include/glibmm-2.4/glibmm/ustring.h:221:27: warning: alias declarations are a C++11 extension [-Wc++11-extensions]
  using const_reference = const gunichar&;
                          ^
/usr/local/include/glibmm-2.4/glibmm/ustring.h:223:20: warning: alias declarations are a C++11 extension [-Wc++11-extensions]
  using iterator = ustring_Iterator;
                   ^
/usr/local/include/glibmm-2.4/glibmm/ustring.h:224:26: warning: alias declarations are a C++11 extension [-Wc++11-extensions]
  using const_iterator = ustring_Iterator;
                         ^
/usr/local/include/glibmm-2.4/glibmm/ustring.h:228:28: warning: alias declarations are a C++11 extension [-Wc++11-extensions]
  using reverse_iterator = std::reverse_iterator;
                           ^
/usr/local/include/glibmm-2.4/glibmm/ustring.h:229:34: warning: alias declarations are a C++11 extension [-Wc++11-extensions]
  using const_reverse_iterator = std::reverse_iterator;
                                 ^
In file included from config.cc:3:
In file included from ../../libgnomeprint/libgnomeprintmm/config.h:6:
In file included from /usr/local/include/glibmm-2.4/glibmm/ustring.h/usr/local/include/glibmm-2.4/glibmm.h::25588::
13In file included from :/usr/local/include/glibmm-2.4/glibmm/thread.h :error47: :
expected ';' at end of declaration listIn file included from 
/usr/local/include/glibmm-2.4/glibmm/error.h:  ~ustring() noexcept;22
:
            ^/usr/local/include/glibmm-2.4/glibmm/exception.h
:            ;30
:23: error/usr/local/include/glibmm-2.4/glibmm/ustring.h: :expected ';' at end of declaration list265
:18:  virtual ~Exception() noexcept = 0; 
warning                      ^: 
                      ;rvalue references are a C++11 extension [-Wc++11-extensions]

  ustring(ustring&& other);
                 ^
/usr/local/include/glibmm-2.4/glibmm/ustring.h:275:29: warning: rvalue references are a C++11 extension [-Wc++11-extensions]
In file included from config.cc  ustring& operator=(ustring&& other);:
3                            ^:

In file included from ../../libgnomeprint/libgnomeprintmm/config.h:6:
In file included from /usr/local/include/glibmm-2.4/glibmm.h:88:
/usr/local/include/glibmm-2.4/glibmm/ustring.hIn file included from :/usr/local/include/glibmm-2.4/glibmm/thread.h290::4722:
:/usr/local/include/glibmm-2.4/glibmm/error.h :warning38: :rvalue references are a C++11 extension [-Wc++11-extensions]11
:   ustring(std::string&& src);error
:                      ^expected ';' at end of declaration list

  ~Error() noexcept override;
          ^
          ;
/usr/local/include/glibmm-2.4/glibmm/error.h:42:30: warning: 'override' keyword is a C++11 extension [-Wc++11-extensions]
/usr/local/include/glibmm-2.4/glibmm/ustring.h  Glib::ustring what() const override;:
333                             ^:
33: warning: rvalue references are a C++11 extension [-Wc++11-extensions]
  ustring& operator=(std::string&& src);/usr/local/include/glibmm-2.4/glibmm/error.h
:                                ^53
:21: warning: alias declarations are a C++11 extension [-Wc++11-extensions]
  using ThrowFunc = void(*)(GError*);/usr/local/include/glibmm-2.4/glibmm/ustring.h
:                    ^339
:26: warning: rvalue references are a C++11 extension [-Wc++11-extensions]
  ustring& assign(ustring&& src);
                         ^
In file included from context.cc:3:
In file included from ../../libgnomeprint/libgnomeprintmm/context.h:6:
In file included from /usr/local/include/glibmm-2.4/glibmm.h:88:
In file included from /usr/local/include/glibmm-2.4/glibmm/thread.h:49:
In file included from /usr/local/include/sigc++-2.0/sigc++/sigc++.h:104:
In file included from /usr/local/include/sigc++-2.0/sigc++/signal.h:8:
In file included from /usr/local/include/sigc++-2.0/sigc++/signal_base.h:27:
In file included from /usr/local/include/sigc++-2.0/sigc++/functors/slot.h:7:
In file included from /usr/local/include/sigc++-2.0/sigc++/adaptors/adaptor_trait.h:10:
/usr/local/include/sigc++-2.0/sigc++/adaptors/deduce_result_type.h:48:32: warning: variadic templates are a C++11 extension [-Wc++11-extensions]
template
                               ^
/usr/local/include/sigc++-2.0/sigc++/adaptors/deduce_result_type.h:53:29: warning: default template arguments for a function template are a C++11 extension [-Wc++11-extensions]
  template::type>
                            ^          ~~~~~~~~~~~~~~~~~~~~~~~~~~~~~~~~~~~~~~~~~~~~~~~~~~~~~~~
In file included from font.cc:3:
In file included from ../../libgnomeprint/libgnomeprintmm/font.h:6:
In file included from /usr/local/include/glibmm-2.4/glibmm.h:88:
In file included from /usr/local/include/glibmm-2.4/glibmm/thread.h:47:
In file included from In file included from enums.cc:3/usr/local/include/glibmm-2.4/glibmm/error.h::
In file included from ../../libgnomeprint/libgnomeprintmm/enums.h:622:
/usr/local/include/sigc++-2.0/sigc++/adaptors/deduce_result_type.hIn file included from /usr/local/include/glibmm-2.4/glibmm.h:88:
:
In file included from :/usr/local/include/glibmm-2.4/glibmm/thread.h:47:
In file included from 64:/usr/local/include/glibmm-2.4/glibmm/exception.h:22:
/usr/local/include/glibmm-2.4/glibmm/ustring.h16: warning: alias declarations are a C++11 extension [-Wc++11-extensions]
:101In file included from /usr/local/include/glibmm-2.4/glibmm/error.h:  using type = decltype (test ());22:

In file included from /usr/local/include/glibmm-2.4/glibmm/exception.h               ^
:22::
29/usr/local/include/glibmm-2.4/glibmm/ustring.h:: 101warning:: 29alias declarations are a C++11 extension [-Wc++11-extensions]:
 warning: alias declarations are a C++11 extension [-Wc++11-extensions]
  using iterator_category = std::bidirectional_iterator_tag;
                            ^
/usr/include/c++/v1/__config/usr/local/include/glibmm-2.4/glibmm/ustring.h::561102::21/usr/local/include/glibmm-2.4/glibmm/ustring.h: note:22  using iterator_category = std::bidirectional_iterator_tag;870:48:
:  expanded from macro 'decltype'warning
:                             ^deleted function definitions are a C++11 extension [-Wc++11-extensions]
#define decltype(x) __typeof__(x)
:                    ^ warning

:   FormatStream(const ustring::FormatStream&) = delete;/usr/local/include/glibmm-2.4/glibmm/ustring.h
                                               ^
In file included from :/usr/local/include/glibmm-2.4/glibmm/ustring.hcontext.cc:alias declarations are a C++11 extension [-Wc++11-extensions]
102:22:  using value_type = gunichar; 
warning871                     ^
:/usr/local/include/glibmm-2.4/glibmm/ustring.h:10359::27:: :  alias declarations are a C++11 extension [-Wc++11-extensions]warning: 3alias declarations are a C++11 extension [-Wc++11-extensions]:

warningIn file included from   using value_type = gunichar;../../libgnomeprint/libgnomeprintmm/context.h
:6:                      ^:
In file included from 
deleted function definitions are a C++11 extension [-Wc++11-extensions]/usr/local/include/glibmm-2.4/glibmm.h
:
88  using difference_type = std::string::difference_type;:

/usr/local/include/glibmm-2.4/glibmm/ustring.h  FormatStream& operator=(const ustring::FormatStream&) = delete;:
                          ^In file included from 
                                                          ^
/usr/local/include/glibmm-2.4/glibmm/thread.h:/usr/local/include/glibmm-2.4/glibmm/ustring.h49:103:
875:In file included from :/usr/local/include/sigc++-2.0/sigc++/sigc++.h:2722104:/usr/local/include/glibmm-2.4/glibmm/ustring.h:
:In file included from  /usr/local/include/sigc++-2.0/sigc++/signal.h:: warning8warning:
: In file included from : alias declarations are a C++11 extension [-Wc++11-extensions]104
alias declarations are a C++11 extension [-Wc++11-extensions]:
/usr/local/include/sigc++-2.0/sigc++/signal_base.h21:  using StreamType = std::wostringstream;  using difference_type = std::string::difference_type;27
:
                     ^In file included from 
/usr/local/include/sigc++-2.0/sigc++/functors/slot.h:
:                           ^7warning
:
: In file included from /usr/local/include/glibmm-2.4/glibmm/ustring.halias declarations are a C++11 extension [-Wc++11-extensions]/usr/local/include/sigc++-2.0/sigc++/adaptors/adaptor_trait.h:
:10410:  using reference = value_type;:
21
/usr/local/include/sigc++-2.0/sigc++/adaptors/deduce_result_type.h:                    ^: 
67warning/usr/local/include/glibmm-2.4/glibmm/ustring.h/usr/local/include/glibmm-2.4/glibmm/ustring.h:::10538: ::883 19warning:alias declarations are a C++11 extension [-Wc++11-extensions]: :variadic templates are a C++11 extension [-Wc++11-extensions]
18 
:warning  using reference = value_type; templateerror: 
alias declarations are a C++11 extension [-Wc++11-extensions]                                     ^

: 
  using pointer = void;expected ';' at end of declaration list

/usr/local/include/sigc++-2.0/sigc++/adaptors/deduce_result_type.h                  ^:
68  ~FormatStream() noexcept;                    ^:

25                 ^/usr/local/include/glibmm-2.4/glibmm/ustring.h:
:                  ;105warning
:: 19alias declarations are a C++11 extension [-Wc++11-extensions]:
 warning: alias declarations are a C++11 extension [-Wc++11-extensions]
/usr/local/include/glibmm-2.4/glibmm/ustring.husing deduce_result_t = typename deduce_result_type::type;  using pointer = void;:

216                        ^                  ^:

21: warning: alias declarations are a C++11 extension [-Wc++11-extensions]
  using size_type = std::string::size_type;
                    ^
/usr/local/include/glibmm-2.4/glibmm/ustring.h/usr/local/include/glibmm-2.4/glibmm/ustring.h::In file included from 216217::21: warning: alias declarations are a C++11 extension [-Wc++11-extensions]
27:  using size_type = std::string::size_type; 
                    ^
warning/usr/local/include/glibmm-2.4/glibmm/ustring.h:217:27::  alias declarations are a C++11 extension [-Wc++11-extensions]warning: alias declarations are a C++11 extension [-Wc++11-extensions]
private.cc
:  using difference_type = std::string::difference_type;
                          ^
  using difference_type = std::string::difference_type;
/usr/local/include/glibmm-2.4/glibmm/ustring.h                          ^:
219:22: warning/usr/local/include/glibmm-2.4/glibmm/ustring.h: alias declarations are a C++11 extension [-Wc++11-extensions]
:219  using value_type = gunichar;:18
22:
                     ^:In file included from 
 ../../libgnomeprint/libgnomeprintmm/private.hwarning/usr/local/include/glibmm-2.4/glibmm/ustring.h:: :22alias declarations are a C++11 extension [-Wc++11-extensions]220:

:In file included from 21  using value_type = gunichar;/usr/local/include/glibmm-2.4/glibmm.h:
:                      ^88warning
:
: In file included from /usr/local/include/glibmm-2.4/glibmm/ustring.halias declarations are a C++11 extension [-Wc++11-extensions]/usr/local/include/glibmm-2.4/glibmm/thread.h
:49:
:In file included from 220  using reference = gunichar&;/usr/local/include/sigc++-2.0/sigc++/sigc++.h
::                    ^10421
:
:/usr/local/include/glibmm-2.4/glibmm/ustring.hIn file included from  :/usr/local/include/sigc++-2.0/sigc++/signal.hwarning221:27: alias declarations are a C++11 extension [-Wc++11-extensions]::
8:
In file included from   using reference = gunichar&;/usr/local/include/sigc++-2.0/sigc++/signal_base.h:25 :

/usr/local/include/sigc++-2.0/sigc++/type_traits.h:                    ^63:27: 
warning: /usr/local/include/glibmm-2.4/glibmm/ustring.hwarning:alias declarations are a C++11 extension [-Wc++11-extensions]
221: using type_trait_pass_t = typename type_trait::pass;:
27                          ^:
alias declarations are a C++11 extension [-Wc++11-extensions] /usr/local/include/sigc++-2.0/sigc++/type_traits.hwarning: :alias declarations are a C++11 extension [-Wc++11-extensions]
66:27: warning
:   using const_reference = const gunichar&;alias declarations are a C++11 extension [-Wc++11-extensions]
  using const_reference = const gunichar&;                          ^


                          ^using type_trait_take_t = typename type_trait::take;

/usr/local/include/glibmm-2.4/glibmm/ustring.h/usr/local/include/glibmm-2.4/glibmm/ustring.h                          ^In file included from 
::223:20: warning: alias declarations are a C++11 extension [-Wc++11-extensions]In file included from 
223:private.cc  using iterator = ustring_Iterator;20::18:

                    ^In file included from warning../../libgnomeprint/libgnomeprintmm/private.h: :
alias declarations are a C++11 extension [-Wc++11-extensions]
22:
In file included from /usr/local/include/glibmm-2.4/glibmm.h:88:
In file included from   using iterator = ustring_Iterator;/usr/local/include/glibmm-2.4/glibmm/ustring.h/usr/local/include/glibmm-2.4/glibmm/thread.h:49:
In file included from :/usr/local/include/sigc++-2.0/sigc++/sigc++.h:104:
In file included from /usr/local/include/sigc++-2.0/sigc++/signal.h:8:
In file included from 224/usr/local/include/sigc++-2.0/sigc++/signal_base.h:26:26:
:
 /usr/local/include/sigc++-2.0/sigc++/trackable.h:40warning                   ^: 
:59context.cc:alias declarations are a C++11 extension [-Wc++11-extensions]:/usr/local/include/glibmm-2.4/glibmm/ustring.h3 ::
error224In file included from : ../../libgnomeprint/libgnomeprintmm/context.h
expected ';' at end of declaration list::6
:
In file included from /usr/local/include/glibmm-2.4/glibmm.h26  using const_iterator = ustring_Iterator;::  trackable_callback(void* data, func_destroy_notify func) noexcept88
 
:
                                                          ^In file included from In file included from warning                         ^: 
/usr/local/include/glibmm-2.4/glibmm/thread.h
:                                                          ;/usr/local/include/glibmm-2.4/glibmm/ustring.halias declarations are a C++11 extension [-Wc++11-extensions]49
:
:
228:In file included from   using const_iterator = ustring_Iterator;/usr/local/include/sigc++-2.0/sigc++/trackable.h
28/usr/local/include/sigc++-2.0/sigc++/sigc++.h::71: :warning                         ^65
104::
/usr/local/include/glibmm-2.4/glibmm/ustring.h In file included from warning: : /usr/local/include/sigc++-2.0/sigc++/signal.hjob.cc::deleted function definitions are a C++11 extension [-Wc++11-extensions]8alias declarations are a C++11 extension [-Wc++11-extensions]:
228
In file included from :/usr/local/include/sigc++-2.0/sigc++/signal_base.h
:  using reverse_iterator = std::reverse_iterator;28:/usr/local/include/glibmm-2.4/glibmm/ustring.h:  trackable_callback_list(const trackable_callback_list& src) = delete;: 

warning271269:
In file included from                                                                 ^:/usr/local/include/sigc++-2.0/sigc++/functors/slot.h:                            ^

alias declarations are a C++11 extension [-Wc++11-extensions]:45/usr/local/include/sigc++-2.0/sigc++/trackable.h8
:
/usr/local/include/glibmm-2.4/glibmm/ustring.h/usr/local/include/sigc++-2.0/sigc++/functors/slot_base.h:::229  using reverse_iterator = std::reverse_iterator;:7257:
:7634                           ^
In file included from 35:3:  ::
warning warningconfig.cc::/usr/local/include/glibmm-2.4/glibmm/ustring.h3: deleted function definitions are a C++11 extension [-Wc++11-extensions] warning
:
warning::   trackable_callback_list& operator=(const trackable_callback_list& src) = delete;In file included from : 
deleted function definitions are a C++11 extension [-Wc++11-extensions]: ../../libgnomeprint/libgnomeprintmm/job.h229:                                                                           ^deleted function definitions are a C++11 extension [-Wc++11-extensions]6
::
34
In file included from :  slot_rep(const slot_rep& src) = delete; 
warning
  Stringify(const ustring::Stringify&) = delete;/usr/local/include/glibmm-2.4/glibmm.h/usr/local/include/sigc++-2.0/sigc++/trackable.h
alias declarations are a C++11 extension [-Wc++11-extensions]:
: 88::
                                            ^                                  ^  using const_reverse_iterator = std::reverse_iterator;73In file included from :

In file included from 50/usr/local/include/glibmm-2.4/glibmm/thread.h/usr/local/include/glibmm-2.4/glibmm/ustring.h:::alias declarations are a C++11 extension [-Wc++11-extensions]1270
/usr/local/include/sigc++-2.0/sigc++/functors/slot_base.h:47  using const_reverse_iterator = std::reverse_iterator;:
 :
59In file included from :warning58 /usr/local/include/glibmm-2.4/glibmm/error.h: :                                 ^warningrvalue references are a C++11 extension [-Wc++11-extensions]: :
2246
:deleted function definitions are a C++11 extension [-Wc++11-extensions]   trackable_callback_list(trackable_callback_list&& src) = delete;

warning:
  Stringify& operator=(const ustring::Stringify&) = delete;In file included from 
/usr/local/include/glibmm-2.4/glibmm/ustring.h: /usr/local/include/glibmm-2.4/glibmm/exception.h
:deleted function definitions are a C++11 extension [-Wc++11-extensions]                                                          ^:
                                                 ^255  slot_rep& operator=(const slot_rep& src) = delete;
22

::
/usr/local/include/sigc++-2.0/sigc++/trackable.h/usr/local/include/glibmm-2.4/glibmm/ustring.h                                             ^13/usr/local/include/glibmm-2.4/glibmm/ustring.h:::
                                 ^ 1286/usr/local/include/sigc++-2.0/sigc++/functors/slot_base.h::73error60::10151::60: 2920::
:../../libgnomeprint/libgnomeprintmm/config.h :warning::  deleted function definitions are a C++11 extension [-Wc++11-extensions]6
 expected ';' at end of declaration list:
  trackable_callback_list(trackable_callback_list&& src) = delete;
 /usr/local/include/glibmm-2.4/glibmm/ustring.hwarning:: 
deleted function definitions are a C++11 extension [-Wc++11-extensions]warning  ~ustring() noexcept;
                                                           ^: 
alias declarations are a C++11 extension [-Wc++11-extensions]In file included from 
255
:/usr/local/include/sigc++-2.0/sigc++/trackable.h            ^/usr/local/include/glibmm-2.4/glibmm.h:  Stringify(const ustring::Stringify&) = delete;13warning::   using iterator_category = std::bidirectional_iterator_tag;:
88

:
                                                  ^rvalue references are a C++11 extension [-Wc++11-extensions]                            ^            ;
In file included from 
/usr/local/include/glibmm-2.4/glibmm/thread.h 74error

/usr/local/include/glibmm-2.4/glibmm/ustring.h/usr/local/include/glibmm-2.4/glibmm/ustring.h: :::expected ';' at end of declaration list  slot_rep(slot_rep&& src) = delete;
102
  ~ustring() noexcept;265/usr/local/include/glibmm-2.4/glibmm/ustring.h61:                   ^:2249:
:18 :

In file included from /usr/local/include/sigc++-2.0/sigc++/functors/slot_base.h::            ^warning /usr/local/include/sigc++-2.0/sigc++/sigc++.h: :::60warning
1041287:
::rvalue references are a C++11 extension [-Wc++11-extensions]            ; 
In file included from 30: 
71:warningalias declarations are a C++11 extension [-Wc++11-extensions] 
: :warning /usr/local/include/sigc++-2.0/sigc++/signal.hrvalue references are a C++11 extension [-Wc++11-extensions]  trackable_callback_list& operator=(trackable_callback_list&& src) = delete;  using value_type = gunichar;warning: 
/usr/local/include/glibmm-2.4/glibmm/ustring.h                     ^

:                                                             ^deleted function definitions are a C++11 extension [-Wc++11-extensions]:
  ustring(ustring&& other);265
:
:/usr/local/include/glibmm-2.4/glibmm/ustring.h/usr/local/include/sigc++-2.0/sigc++/trackable.h18
::103  slot_rep(slot_rep&& src) = delete;:deleted function definitions are a C++11 extension [-Wc++11-extensions]                 ^278 

                             ^:: 
warning:
: In file included from 74warning  Stringify& operator=(const ustring::Stringify&) = delete;
alias declarations are a C++11 extension [-Wc++11-extensions]/usr/local/include/sigc++-2.0/sigc++/signal_base.h/usr/local/include/sigc++-2.0/sigc++/functors/slot_base.h: :
:25  using difference_type = std::string::difference_type;:
:/usr/local/include/sigc++-2.0/sigc++/type_traits.h/usr/local/include/glibmm-2.4/glibmm/ustring.h61
:71rvalue references are a C++11 extension [-Wc++11-extensions]
:
                          ^63:
:275:   ustring(ustring&& other);                                                                      ^31/usr/local/include/glibmm-2.4/glibmm/ustring.h27
::::  104warning:
29                 ^:/usr/local/include/glibmm-2.4/glibmm/ustring.hwarning
:  rvalue references are a C++11 extension [-Wc++11-extensions]warning21: : /usr/local/include/glibmm-2.4/glibmm/ustring.h:warning:: 
deleted function definitions are a C++11 extension [-Wc++11-extensions] rvalue references are a C++11 extension [-Wc++11-extensions]warning
alias declarations are a C++11 extension [-Wc++11-extensions]

:1305  ustring& operator=(ustring&& other);275  trackable_callback_list& operator=(trackable_callback_list&& src) = delete;:
:: 29  slot_rep& operator=(slot_rep&& src) = delete;:using type_trait_pass_t = typename type_trait::pass;                                                                      ^alias declarations are a C++11 extension [-Wc++11-extensions]



                            ^55
:  warning
: warning  using reference = value_type;: 
deleted function definitions are a C++11 extension [-Wc++11-extensions]                    ^                          ^

rvalue references are a C++11 extension [-Wc++11-extensions]/usr/local/include/glibmm-2.4/glibmm/ustring.h/usr/local/include/glibmm-2.4/glibmm/ustring.h
:
290  Stringify(const ustring::Stringify&) = delete;  ustring& operator=(ustring&& other);::                              ^
22
/usr/local/include/sigc++-2.0/sigc++/type_traits.h105:                            ^66::19 
::                                                      ^27warning:
 :  rvalue references are a C++11 extension [-Wc++11-extensions]warningwarning

: : alias declarations are a C++11 extension [-Wc++11-extensions]/usr/local/include/glibmm-2.4/glibmm/ustring.h/usr/local/include/sigc++-2.0/sigc++/functors/slot_base.h::  ustring(std::string&& src);alias declarations are a C++11 extension [-Wc++11-extensions]/usr/local/include/glibmm-2.4/glibmm/ustring.h1306
::

61290:  using pointer = void;                     ^41
:using type_trait_take_t = typename type_trait::take;:
                           ^warning22
:: 
75 deleted function definitions are a C++11 extension [-Wc++11-extensions]                  ^warning

: :/usr/local/include/glibmm-2.4/glibmm/ustring.hrvalue references are a C++11 extension [-Wc++11-extensions]   slot_rep& operator=(slot_rep&& src) = delete;:

333warning:: 33  ustring(std::string&& src);                                        ^
:                     ^
In file included from deleted function definitions are a C++11 extension [-Wc++11-extensions] 
/usr/local/include/glibmm-2.4/glibmm/ustring.hconfig.ccwarning
::/usr/local/include/sigc++-2.0/sigc++/functors/slot_base.h2163::
21In file included from ::  Stringify& operator=(const ustring::Stringify&) = delete;../../libgnomeprint/libgnomeprintmm/config.h: 91rvalue references are a C++11 extension [-Wc++11-extensions]: /usr/local/include/glibmm-2.4/glibmm/ustring.h59:
:333warning:  ustring& operator=(std::string&& src);6

33:
                                ^:
                                                                          ^:In file included from  /usr/local/include/glibmm-2.4/glibmm.h
warning : /usr/local/include/glibmm-2.4/glibmm/ustring.halias declarations are a C++11 extension [-Wc++11-extensions]:
339: errorrvalue references are a C++11 extension [-Wc++11-extensions]:   using size_type = std::string::size_type;:
expected ';' at end of declaration list26:

/usr/local/include/glibmm-2.4/glibmm/ustring.h                    ^:88  ustring& operator=(std::string&& src);
1324
  inline slot_rep(hook call__, hook destroy__, hook dup__) noexcept/usr/local/include/glibmm-2.4/glibmm/ustring.h:
:In file included from 
/usr/local/include/glibmm-2.4/glibmm/thread.h51                                                          ^::
49                                                          ; :

                                ^:warningIn file included from 
/usr/local/include/sigc++-2.0/sigc++/sigc++.h: :rvalue references are a C++11 extension [-Wc++11-extensions]217104
:: :
  ustring& assign(ustring&& src);27
:In file included from /usr/local/include/sigc++-2.0/sigc++/functors/slot_base.h/usr/local/include/sigc++-2.0/sigc++/signal.h :/usr/local/include/glibmm-2.4/glibmm/ustring.h                         ^warningwarning8: : ::
deleted function definitions are a C++11 extension [-Wc++11-extensions]alias declarations are a C++11 extension [-Wc++11-extensions]
In file included from 
/usr/local/include/sigc++-2.0/sigc++/signal_base.h339::15026:  using difference_type = std::string::difference_type;26::
 
:
37/usr/local/include/sigc++-2.0/sigc++/trackable.h                          ^:
warning  Stringify(const ustring::Stringify&) = delete; 
: :rvalue references are a C++11 extension [-Wc++11-extensions]error/usr/local/include/glibmm-2.4/glibmm/ustring.h: 40                                                  ^:expected ';' at end of declaration list
59
:
   ustring& assign(ustring&& src);:error219
:                         ^/usr/local/include/glibmm-2.4/glibmm/ustring.h
:: 1325  inline slot_do_bind(slot_rep* rep) noexcept : rep_(rep) {}:
71expected ';' at end of declaration list:                                    ^ 
warning22: :deleted function definitions are a C++11 extension [-Wc++11-extensions] 
  trackable_callback(void* data, func_destroy_notify func) noexcept                                    ;warning

: 
                                                          ^alias declarations are a C++11 extension [-Wc++11-extensions]  Stringify& operator=(const ustring::Stringify&) = delete;


                                                                      ^                                                          ;
/usr/local/include/sigc++-2.0/sigc++/functors/slot_base.h
  using value_type = gunichar;:
168                     ^:
39:/usr/local/include/glibmm-2.4/glibmm/ustring.h :/usr/local/include/sigc++-2.0/sigc++/trackable.h/usr/local/include/glibmm-2.4/glibmm/ustring.h:134471:::65error::  220expected ';' at end of declaration listwarning
:5721:::  deleted function definitions are a C++11 extension [-Wc++11-extensions] /usr/local/include/sigc++-2.0/sigc++/trackable.h
:  inline slot_do_unbind(slot_rep* rep) noexcept : rep_(rep) {}116warning
warning:  trackable_callback_list(const trackable_callback_list& src) = delete;14                                      ^:
: 
deleted function definitions are a C++11 extension [-Wc++11-extensions]                                       ;

:                                                                 ^alias declarations are a C++11 extension [-Wc++11-extensions]error
  Stringify(const ustring::Stringify&) = delete;: 
expected ';' at end of declaration list/usr/local/include/sigc++-2.0/sigc++/functors/slot_base.h
  using reference = gunichar&;:
/usr/local/include/sigc++-2.0/sigc++/trackable.h  trackable() noexcept;273

:                    ^14                                                        ^:
              ^error:: 72
:
76/usr/local/include/glibmm-2.4/glibmm/ustring.hexpected ';' at end of declaration list::/usr/local/include/glibmm-2.4/glibmm/ustring.h             ; 
warning
: 221deleted function definitions are a C++11 extension [-Wc++11-extensions]/usr/local/include/sigc++-2.0/sigc++/trackable.h  slot_base() noexcept;:
:118
::             ^3427::   trackable_callback_list& operator=(const trackable_callback_list& src) = delete;error
1345
:  expected ';' at end of declaration list                                                                           ^
             ;:
warning  trackable(const trackable& src) noexcept;

: /usr/local/include/sigc++-2.0/sigc++/functors/slot_base.halias declarations are a C++11 extension [-Wc++11-extensions]77
                                 ^/usr/local/include/sigc++-2.0/sigc++/trackable.h
  using const_reference = const gunichar&;::
                           ^278warning                                 ;:
36: :deleted function definitions are a C++11 extension [-Wc++11-extensions]
/usr/local/include/glibmm-2.4/glibmm/ustring.h::73/usr/local/include/sigc++-2.0/sigc++/trackable.h/usr/local/include/glibmm-2.4/glibmm/ustring.h :
:223::50120:: 87020:22warning48::  Stringify& operator=(const ustring::Stringify&) = delete; : warning:rvalue references are a C++11 extension [-Wc++11-extensions] 
 error
:                                                                             ^warningdeleted function definitions are a C++11 extension [-Wc++11-extensions]: : 
expected ';' at end of declaration list

warningrvalue references are a C++11 extension [-Wc++11-extensions]  trackable_callback_list(trackable_callback_list&& src) = delete;
  FormatStream(const ustring::FormatStream&) = delete;
  explicit slot_base(rep_type* rep) noexcept;                                                 ^: /usr/local/include/glibmm-2.4/glibmm/ustring.h
:                                   ^alias declarations are a C++11 extension [-Wc++11-extensions]  trackable(trackable&& src);870



:                                               ^48/usr/local/include/sigc++-2.0/sigc++/trackable.h                                   ;:
 :
73  using iterator = ustring_Iterator;

                     ^                   ^

warning:: /usr/local/include/glibmm-2.4/glibmm/ustring.hdeleted function definitions are a C++11 extension [-Wc++11-extensions]:/usr/local/include/sigc++-2.0/sigc++/trackable.h87160/usr/local/include/sigc++-2.0/sigc++/functors/slot_base.h/usr/local/include/glibmm-2.4/glibmm/ustring.h
::224  FormatStream(const ustring::FormatStream&) = delete;:::59
::26289:124                                               ^:: 33warning : 22warning 
: warningdeleted function definitions are a C++11 extension [-Wc++11-extensions]: :
: alias declarations are a C++11 extension [-Wc++11-extensions]/usr/local/include/glibmm-2.4/glibmm/ustring.h deleted function definitions are a C++11 extension [-Wc++11-extensions]
warning  FormatStream& operator=(const ustring::FormatStream&) = delete;: warningrvalue references are a C++11 extension [-Wc++11-extensions]: 

                                                          ^  using const_iterator = ustring_Iterator;rvalue references are a C++11 extension [-Wc++11-extensions]
  trackable& operator=(trackable&& src);                         ^

:/usr/local/include/glibmm-2.4/glibmm/ustring.h  slot_base(slot_base&& src);
:
871  trackable_callback_list(trackable_callback_list&& src) = delete;
                     ^

                                                           ^875::
/usr/local/include/glibmm-2.4/glibmm/ustring.h59:22228:
:                                ^/usr/local/include/sigc++-2.0/sigc++/trackable.h: :28
:  74warning:: warningalias declarations are a C++11 extension [-Wc++11-extensions]: warningdeleted function definitions are a C++11 extension [-Wc++11-extensions]

61:   using reverse_iterator = std::reverse_iterator;alias declarations are a C++11 extension [-Wc++11-extensions]

                           ^:  FormatStream& operator=(const ustring::FormatStream&) = delete;

  using StreamType = std::wostringstream;                                                           ^warning/usr/local/include/glibmm-2.4/glibmm/ustring.h

:                      ^:/usr/local/include/glibmm-2.4/glibmm/ustring.hrvalue references are a C++11 extension [-Wc++11-extensions]229
::/usr/local/include/sigc++-2.0/sigc++/functors/slot_base.h:30034::8753 :warning: alias declarations are a C++11 extension [-Wc++11-extensions]: warning
22/usr/local/include/glibmm-2.4/glibmm/ustring.h:   using const_reverse_iterator = std::reverse_iterator;:
                                  ^warning
: explicit conversion functions are a C++11 extension [-Wc++11-extensions]:
883alias declarations are a C++11 extension [-Wc++11-extensions]:18: error: 
  explicit operator bool() const noexcept;expected ';' at end of declaration list/usr/local/include/glibmm-2.4/glibmm/ustring.h

  ^~~~~~~~  using StreamType = std::wostringstream;/usr/local/include/glibmm-2.4/glibmm/ustring.h:  ~FormatStream() noexcept;:1643

:255
48:                 ^:                     ^13 
:
/usr/local/include/sigc++-2.0/sigc++/functors/slot_base.h                  ;errorwarning
: deleted function definitions are a C++11 extension [-Wc++11-extensions]: :
300:expected ';' at end of declaration list33bool operator==(const ustring& lhs, int rhs) = delete;
:/usr/local/include/glibmm-2.4/glibmm/ustring.h
  ~ustring() noexcept;                                               ^:
883
:            ^ 18
error/usr/local/include/glibmm-2.4/glibmm/ustring.h:: : 1644expected ';' at end of declaration list            ;error
:: 48:expected ';' at end of declaration list
   ~FormatStream() noexcept;
                 ^warning/usr/local/include/glibmm-2.4/glibmm/ustring.h
:
                 ;265:  explicit operator bool() const noexcept;
: 18deleted function definitions are a C++11 extension [-Wc++11-extensions]:
 warning: 

                                ^rvalue references are a C++11 extension [-Wc++11-extensions]

                                ;  ustring(ustring&& other);bool operator==(int lhs, const ustring& rhs) = delete;


                                               ^                 ^
/usr/local/include/sigc++-2.0/sigc++/functors/slot_base.h:
/usr/local/include/glibmm-2.4/glibmm/ustring.h:/usr/local/include/glibmm-2.4/glibmm/ustring.h309  trackable_callback_list& operator=(trackable_callback_list&& src) = delete;::1645:6348
275:                                                            ^:: 29
 :warning : error/usr/local/include/sigc++-2.0/sigc++/trackable.h: deleted function definitions are a C++11 extension [-Wc++11-extensions]warning:expected ';' at end of declaration list
: 74
:bool operator!=(const ustring& lhs, int rhs) = delete;rvalue references are a C++11 extension [-Wc++11-extensions]71
  void set_parent(void* parent, void* (*cleanup)(void*)) const noexcept;
:
  ustring& operator=(ustring&& other);                                               ^                                                               ^
warning

:                             ^                                                              ;
deleted function definitions are a C++11 extension [-Wc++11-extensions]
/usr/local/include/glibmm-2.4/glibmm/ustring.h
:1646/usr/local/include/glibmm-2.4/glibmm/ustring.h::48  trackable_callback_list& operator=(trackable_callback_list&& src) = delete;/usr/local/include/sigc++-2.0/sigc++/functors/slot_base.h290
:                                                                      ^:328
::22 :warning : warningdeleted function definitions are a C++11 extension [-Wc++11-extensions]: 
rvalue references are a C++11 extension [-Wc++11-extensions]28
bool operator!=(int lhs, const ustring& rhs) = delete;:
  ustring(std::string&& src);                                               ^

                     ^ 
/usr/local/include/glibmm-2.4/glibmm/ustring.herror:: 1647expected ';' at end of declaration list:
47:   inline bool empty() const noexceptwarning
:                            ^deleted function definitions are a C++11 extension [-Wc++11-extensions]

/usr/local/include/glibmm-2.4/glibmm/ustring.h                           ;:bool operator<(const ustring& lhs, int rhs) = delete;333
:                                              ^33
:
 /usr/local/include/glibmm-2.4/glibmm/ustring.hwarning:: 1648rvalue references are a C++11 extension [-Wc++11-extensions]:
47/usr/local/include/sigc++-2.0/sigc++/functors/slot_base.h:  ustring& operator=(std::string&& src); 
warning                                ^: 
deleted function definitions are a C++11 extension [-Wc++11-extensions]:
350:17bool operator<(int lhs, const ustring& rhs) = delete;:
/usr/local/include/glibmm-2.4/glibmm/ustring.h                                              ^:
339 :error26/usr/local/include/glibmm-2.4/glibmm/ustring.h:: 1649warning:: 47rvalue references are a C++11 extension [-Wc++11-extensions]:
 : warning  ustring& assign(ustring&& src);: 
deleted function definitions are a C++11 extension [-Wc++11-extensions]                         ^

expected ';' at end of declaration list
bool operator>(const ustring& lhs, int rhs) = delete;
  bool unblock() noexcept;                                              ^

                ^
                ;
/usr/local/include/glibmm-2.4/glibmm/ustring.h:1650:47:/usr/local/include/sigc++-2.0/sigc++/functors/slot_base.h :warning371: :deleted function definitions are a C++11 extension [-Wc++11-extensions]33
: warning: bool operator>(int lhs, const ustring& rhs) = delete;rvalue references are a C++11 extension [-Wc++11-extensions]

                                              ^
  slot_base& operator=(slot_base&& src);
                                ^
/usr/local/include/glibmm-2.4/glibmm/ustring.h:1651:48: warning: deleted function definitions are a C++11 extension [-Wc++11-extensions]
bool operator<=(const ustring& lhs, int rhs) = delete;
                                               ^
/usr/local/include/glibmm-2.4/glibmm/ustring.h:1652:48: warning: deleted function definitions are a C++11 extension [-Wc++11-extensions]
In file included from context.ccbool operator<=(int lhs, const ustring& rhs) = delete;:
3                                               ^:

In file included from ../../libgnomeprint/libgnomeprintmm/context.h:6/usr/local/include/glibmm-2.4/glibmm/ustring.h:
:In file included from 1653/usr/local/include/glibmm-2.4/glibmm.h::4888::
 In file included from warning/usr/local/include/glibmm-2.4/glibmm/thread.h: :deleted function definitions are a C++11 extension [-Wc++11-extensions]49
:
In file included from /usr/local/include/sigc++-2.0/sigc++/sigc++.h:bool operator>=(const ustring& lhs, int rhs) = delete;104/usr/local/include/glibmm-2.4/glibmm/ustring.h
:
:                                               ^In file included from 1269
/usr/local/include/sigc++-2.0/sigc++/signal.h::458/usr/local/include/glibmm-2.4/glibmm/ustring.h::
: In file included from 1654warning/usr/local/include/sigc++-2.0/sigc++/signal_base.h:: :48deleted function definitions are a C++11 extension [-Wc++11-extensions]27:
:
 /usr/local/include/sigc++-2.0/sigc++/functors/slot.h  Stringify(const ustring::Stringify&) = delete;warning:
: 74                                            ^deleted function definitions are a C++11 extension [-Wc++11-extensions]:

58: warningbool operator>=(int lhs, const ustring& rhs) = delete;: /usr/local/include/glibmm-2.4/glibmm/ustring.h
deleted function definitions are a C++11 extension [-Wc++11-extensions]:                                               ^
/usr/local/include/glibmm-2.4/glibmm/ustring.h
1270:  typed_slot_rep& operator=(const typed_slot_rep& src) = delete;:1269
59:                                                         ^:45
 :/usr/local/include/sigc++-2.0/sigc++/functors/slot.hwarning :warning76: : :deleted function definitions are a C++11 extension [-Wc++11-extensions]deleted function definitions are a C++11 extension [-Wc++11-extensions]32

: warning:   Stringify(const ustring::Stringify&) = delete;rvalue references are a C++11 extension [-Wc++11-extensions]
  Stringify& operator=(const ustring::Stringify&) = delete;
                                            ^

  typed_slot_rep(typed_slot_rep&& src) = delete;                                                          ^

                               ^
/usr/local/include/glibmm-2.4/glibmm/ustring.h:1270/usr/local/include/sigc++-2.0/sigc++/functors/slot.h::5976:: 42warning/usr/local/include/glibmm-2.4/glibmm/ustring.h:: : deleted function definitions are a C++11 extension [-Wc++11-extensions]warning1286
: :deleted function definitions are a C++11 extension [-Wc++11-extensions]51
  Stringify& operator=(const ustring::Stringify&) = delete;:
   typed_slot_rep(typed_slot_rep&& src) = delete;                                                          ^warning

:                                          ^deleted function definitions are a C++11 extension [-Wc++11-extensions]

/usr/local/include/sigc++-2.0/sigc++/functors/slot.h:  Stringify(const ustring::Stringify&) = delete;77
:                                                  ^43
: warning: /usr/local/include/glibmm-2.4/glibmm/ustring.hrvalue references are a C++11 extension [-Wc++11-extensions]/usr/local/include/glibmm-2.4/glibmm/ustring.h:
1286::128751  typed_slot_rep& operator=(typed_slot_rep&& src) = delete;:
                                           ^warning:
: 71deleted function definitions are a C++11 extension [-Wc++11-extensions]/usr/local/include/sigc++-2.0/sigc++/functors/slot.h:
: 77warning:: 53deleted function definitions are a C++11 extension [-Wc++11-extensions]:
  Stringify(const ustring::Stringify&) = delete; 
warning                                                  ^/usr/local/include/glibmm-2.4/glibmm/ustring.h:   Stringify& operator=(const ustring::Stringify&) = delete;

:deleted function definitions are a C++11 extension [-Wc++11-extensions]                                                                      ^
870
/usr/local/include/glibmm-2.4/glibmm/ustring.h  typed_slot_rep& operator=(typed_slot_rep&& src) = delete;::1287
:                                                    ^71
:48 :/usr/local/include/glibmm-2.4/glibmm/ustring.hwarning :: warning1305deleted function definitions are a C++11 extension [-Wc++11-extensions]: :
55In file included from deleted function definitions are a C++11 extension [-Wc++11-extensions]wrap_init.cc  Stringify& operator=(const ustring::Stringify&) = delete;::

 10                                                                      ^:

In file included from   FormatStream(const ustring::FormatStream&) = delete;warning/usr/local/include/glibmm-2.4/glibmm/error.h
::                                                ^deleted function definitions are a C++11 extension [-Wc++11-extensions]22

:
/usr/local/include/glibmm-2.4/glibmm/exception.h:  Stringify(const ustring::Stringify&) = delete;30/usr/local/include/glibmm-2.4/glibmm/ustring.h
/usr/local/include/glibmm-2.4/glibmm/ustring.h                                                      ^:::
130587123::: /usr/local/include/glibmm-2.4/glibmm/ustring.h55error59::: :1306 :warning75/usr/local/include/sigc++-2.0/sigc++/functors/slot.h:: 169: expected ';' at end of declaration list warningwarning: : deleted function definitions are a C++11 extension [-Wc++11-extensions]deleted function definitions are a C++11 extension [-Wc++11-extensions]
:deleted function definitions are a C++11 extension [-Wc++11-extensions]
97  Stringify& operator=(const ustring::Stringify&) = delete;:
                                                                           ^error
: 
a space is required between consecutive right angle brackets (use '> >')

  FormatStream& operator=(const ustring::FormatStream&) = delete;  virtual ~Exception() noexcept = 0;

                                                          ^                      ^  Stringify(const ustring::Stringify&) = delete;      return (typed_rep->functor_).SIGC_WORKAROUND_OPERATOR_PARENTHESES>



                                                                                                ^~/usr/local/include/glibmm-2.4/glibmm/ustring.h/usr/local/include/glibmm-2.4/glibmm/ustring.h:                      ;:
1324                                                                                                > >:
51875
                                                      ^::
 22warning::  deleted function definitions are a C++11 extension [-Wc++11-extensions]/usr/local/include/glibmm-2.4/glibmm/ustring.hwarning
:: 1306In file included from :  Stringify(const ustring::Stringify&) = delete;75
:                                                  ^ 
warningalias declarations are a C++11 extension [-Wc++11-extensions]: wrap_init.ccdeleted function definitions are a C++11 extension [-Wc++11-extensions]/usr/local/include/glibmm-2.4/glibmm/ustring.h
:
:/usr/local/include/sigc++-2.0/sigc++/functors/slot.h10  using StreamType = std::wostringstream;1325:  Stringify& operator=(const ustring::Stringify&) = delete;:

:20571:
124                                                                          ^                     ^:
 :/usr/local/include/glibmm-2.4/glibmm/error.hwarning
: : 38errordeleted function definitions are a C++11 extension [-Wc++11-extensions]:: 
11a space is required between consecutive right angle brackets (use '> >'):  Stringify& operator=(const ustring::Stringify&) = delete;
 /usr/local/include/glibmm-2.4/glibmm/ustring.h
error:                                                                      ^1324
:      return (typed_rep->functor_).SIGC_WORKAROUND_OPERATOR_PARENTHESES, type_trait_take_t>: 51
expected ';' at end of declaration list:/usr/local/include/glibmm-2.4/glibmm/ustring.h
:/usr/local/include/sigc++-2.0/sigc++/trackable.h/usr/local/include/glibmm-2.4/glibmm/ustring.h                                                                                                                           ^~ 
  ~Error() noexcept override;:
:1344116                                                                                                                           > >:88314::          ^ warning
error:: 18deleted function definitions are a C++11 extension [-Wc++11-extensions]:: 
 expected ';' at end of declaration list57
:error          ;   trackable() noexcept;warning
: 
expected ';' at end of declaration list             ^/usr/local/include/sigc++-2.0/sigc++/functors/slot.h: 
deleted function definitions are a C++11 extension [-Wc++11-extensions]:
  ~FormatStream() noexcept;243
:
  Stringify(const ustring::Stringify&) = delete;  Stringify(const ustring::Stringify&) = delete;

             ;                 ^
                                                  ^

/usr/local/include/glibmm-2.4/glibmm/error.h                                                        ^151
/usr/local/include/sigc++-2.0/sigc++/trackable.h
:::                 ; /usr/local/include/glibmm-2.4/glibmm/ustring.h/usr/local/include/glibmm-2.4/glibmm/ustring.h:error118
: :a space is required between consecutive right angle brackets (use '> >')34
:42 :error1345: 30      return (typed_rep->functor_).SIGC_WORKAROUND_OPERATOR_PARENTHESES, type_trait_take_t, type_trait_take_t>::77:expected ';' at end of declaration list
:                                                                                                                                                      ^~ 
warning
 1325:   trackable(const trackable& src) noexcept;                                                                                                                                                      > >:
warningdeleted function definitions are a C++11 extension [-Wc++11-extensions]71: 

'override' keyword is a C++11 extension [-Wc++11-extensions]:                                 ^ 
warning                                 ;: 
deleted function definitions are a C++11 extension [-Wc++11-extensions]  Stringify& operator=(const ustring::Stringify&) = delete;

  Glib::ustring what() const override;fatal error

                             ^/usr/local/include/sigc++-2.0/sigc++/trackable.h
:                                                                             ^:  Stringify& operator=(const ustring::Stringify&) = delete;
too many errors emitted, stopping now [-ferror-limit=]

                                                                      ^120/usr/local/include/glibmm-2.4/glibmm/error.h:
:2253:: 21warning::  rvalue references are a C++11 extension [-Wc++11-extensions]warning
: /usr/local/include/glibmm-2.4/glibmm/ustring.halias declarations are a C++11 extension [-Wc++11-extensions]  trackable(trackable&& src);:

1344                     ^  using ThrowFunc = void(*)(GError*);:

57                    ^:
 /usr/local/include/sigc++-2.0/sigc++/trackable.hwarning:: 124deleted function definitions are a C++11 extension [-Wc++11-extensions]:
33: warning  Stringify(const ustring::Stringify&) = delete;: 
rvalue references are a C++11 extension [-Wc++11-extensions]                                                        ^

  trackable& operator=(trackable&& src);
                                ^
/usr/local/include/glibmm-2.4/glibmm/ustring.h:1345:77: warning: deleted function definitions are a C++11 extension [-Wc++11-extensions]
  Stringify& operator=(const ustring::Stringify&) = delete;
                                                                            ^
/usr/local/include/glibmm-2.4/glibmm/ustring.h:1643:48: warning: deleted function definitions are a C++11 extension [-Wc++11-extensions]
bool operator==(const ustring& lhs, int rhs) = delete;
                                               ^
/usr/local/include/glibmm-2.4/glibmm/ustring.h:1644:48: warning: deleted function definitions are a C++11 extension [-Wc++11-extensions]
bool operator==(int lhs, const ustring& rhs) = delete;
                                               ^
/usr/local/include/glibmm-2.4/glibmm/ustring.h:1645:48: warning: deleted function definitions are a C++11 extension [-Wc++11-extensions]
bool operator!=(const ustring& lhs, int rhs) = delete;
                                               ^
/usr/local/include/glibmm-2.4/glibmm/ustring.h:1646:48: warning: deleted function definitions are a C++11 extension [-Wc++11-extensions]
bool operator!=(int lhs, const ustring& rhs) = delete;
                                               ^
/usr/local/include/glibmm-2.4/glibmm/ustring.h:1647:47: warning: deleted function definitions are a C++11 extension [-Wc++11-extensions]
bool operator<(const ustring& lhs, int rhs) = delete;
                                              ^
/usr/local/include/glibmm-2.4/glibmm/ustring.h:1648:47: warning: deleted function definitions are a C++11 extension [-Wc++11-extensions]
bool operator<(int lhs, const ustring& rhs) = delete;
                                              ^
/usr/local/include/glibmm-2.4/glibmm/ustring.h:1649:47: warning: deleted function definitions are a C++11 extension [-Wc++11-extensions]
bool operator>(const ustring& lhs, int rhs) = delete;
                                              ^
/usr/local/include/glibmm-2.4/glibmm/ustring.h:1650:47: warning: deleted function definitions are a C++11 extension [-Wc++11-extensions]
bool operator>(int lhs, const ustring& rhs) = delete;
                                              ^
/usr/local/include/glibmm-2.4/glibmm/ustring.h:1651:48: warning: deleted function definitions are a C++11 extension [-Wc++11-extensions]
bool operator<=(const ustring& lhs, int rhs) = delete;
                                               ^
/usr/local/include/glibmm-2.4/glibmm/ustring.h:1652:48: warning: deleted function definitions are a C++11 extension [-Wc++11-extensions]
bool operator<=(int lhs, const ustring& rhs) = delete;
                                               ^
/usr/local/include/glibmm-2.4/glibmm/ustring.h:1653:48: warning: deleted function definitions are a C++11 extension [-Wc++11-extensions]
bool operator>=(const ustring& lhs, int rhs) = delete;
                                               ^
/usr/local/include/glibmm-2.4/glibmm/ustring.h:1654:48: warning: deleted function definitions are a C++11 extension [-Wc++11-extensions]
bool operator>=(int lhs, const ustring& rhs) = delete;
                                               ^
/usr/local/include/glibmm-2.4/glibmm/ustring.h:1643:48: warning: deleted function definitions are a C++11 extension [-Wc++11-extensions]
/usr/local/include/glibmm-2.4/glibmm/ustring.hbool operator==(const ustring& lhs, int rhs) = delete;:
1269                                               ^:
45: warning: /usr/local/include/glibmm-2.4/glibmm/ustring.hdeleted function definitions are a C++11 extension [-Wc++11-extensions]:
1644:48:  Stringify(const ustring::Stringify&) = delete; 
warning                                            ^: 
deleted function definitions are a C++11 extension [-Wc++11-extensions]
bool operator==(int lhs, const ustring& rhs) = delete;/usr/local/include/glibmm-2.4/glibmm/ustring.h
:                                               ^1270
:59In file included from :font.cc/usr/local/include/glibmm-2.4/glibmm/ustring.h ::warning31645: :
:deleted function definitions are a C++11 extension [-Wc++11-extensions]In file included from 48
../../libgnomeprint/libgnomeprintmm/font.h:: 6warning  Stringify& operator=(const ustring::Stringify&) = delete;:
: 
In file included from deleted function definitions are a C++11 extension [-Wc++11-extensions]                                                          ^/usr/local/include/glibmm-2.4/glibmm.h

:88:
In file included from /usr/local/include/glibmm-2.4/glibmm/thread.h:47:
In file included from /usr/local/include/glibmm-2.4/glibmm/error.h:22:
bool operator!=(const ustring& lhs, int rhs) = delete;/usr/local/include/glibmm-2.4/glibmm/exception.h
:                                               ^30
:23: error: expected ';' at end of declaration list/usr/local/include/glibmm-2.4/glibmm/ustring.h
/usr/local/include/glibmm-2.4/glibmm/ustring.h::  virtual ~Exception() noexcept = 0;12861646
::                      ^5148
::                      ;  
warningwarning: : deleted function definitions are a C++11 extension [-Wc++11-extensions]deleted function definitions are a C++11 extension [-Wc++11-extensions]

  Stringify(const ustring::Stringify&) = delete;bool operator!=(int lhs, const ustring& rhs) = delete;
In file included from 
                                                  ^font.cc                                               ^
:
3:
In file included from ../../libgnomeprint/libgnomeprintmm/font.h:6:
In file included from /usr/local/include/glibmm-2.4/glibmm/ustring.h/usr/local/include/glibmm-2.4/glibmm.h/usr/local/include/glibmm-2.4/glibmm/ustring.h:::1287881647::
:71In file included from 47:/usr/local/include/glibmm-2.4/glibmm/thread.h: warning:  deleted function definitions are a C++11 extension [-Wc++11-extensions]
:warningbool operator<(const ustring& lhs, int rhs) = delete;
: deleted function definitions are a C++11 extension [-Wc++11-extensions]
                                              ^
  Stringify& operator=(const ustring::Stringify&) = delete;
                                                                      ^/usr/local/include/glibmm-2.4/glibmm/ustring.h
:1648:47: warning: deleted function definitions are a C++11 extension [-Wc++11-extensions]
/usr/local/include/glibmm-2.4/glibmm/ustring.h:bool operator<(int lhs, const ustring& rhs) = delete;1305
:                                              ^55
: warning/usr/local/include/glibmm-2.4/glibmm/ustring.h47: deleted function definitions are a C++11 extension [-Wc++11-extensions]:
1649::
47  Stringify(const ustring::Stringify&) = delete;:
                                                       ^warning
: deleted function definitions are a C++11 extension [-Wc++11-extensions]
/usr/local/include/glibmm-2.4/glibmm/ustring.h/usr/local/include/glibmm-2.4/glibmm/error.h:bool operator>(const ustring& lhs, int rhs) = delete;
1306                                              ^
:75:/usr/local/include/glibmm-2.4/glibmm/ustring.h::1650 38warning: ::47:deleted function definitions are a C++11 extension [-Wc++11-extensions]
 11warning  Stringify& operator=(const ustring::Stringify&) = delete;
                                                                          ^
: :deleted function definitions are a C++11 extension [-Wc++11-extensions]
 error: expected ';' at end of declaration list
bool operator>(int lhs, const ustring& rhs) = delete;
                                              ^
  ~Error() noexcept override;
          ^
          ;
/usr/local/include/glibmm-2.4/glibmm/ustring.h:/usr/local/include/glibmm-2.4/glibmm/ustring.h:13241651::5148::  warningwarning: : deleted function definitions are a C++11 extension [-Wc++11-extensions]deleted function definitions are a C++11 extension [-Wc++11-extensions]/usr/local/include/glibmm-2.4/glibmm/error.h

:42:30:bool operator<=(const ustring& lhs, int rhs) = delete;  Stringify(const ustring::Stringify&) = delete;

                                               ^
                                                  ^
 /usr/local/include/glibmm-2.4/glibmm/ustring.h:1652/usr/local/include/glibmm-2.4/glibmm/ustring.h::481325:: 71warning::  deleted function definitions are a C++11 extension [-Wc++11-extensions]warning
: warningdeleted function definitions are a C++11 extension [-Wc++11-extensions]
bool operator<=(int lhs, const ustring& rhs) = delete;: 
  Stringify& operator=(const ustring::Stringify&) = delete;
                                               ^
                                                                      ^
'override' keyword is a C++11 extension [-Wc++11-extensions]/usr/local/include/glibmm-2.4/glibmm/ustring.h:1653:48: warning: 
/usr/local/include/glibmm-2.4/glibmm/ustring.hdeleted function definitions are a C++11 extension [-Wc++11-extensions]:  Glib::ustring what() const override;
1344
:                             ^57bool operator>=(const ustring& lhs, int rhs) = delete;
:
                                                ^warning
: /usr/local/include/glibmm-2.4/glibmm/error.hdeleted function definitions are a C++11 extension [-Wc++11-extensions]:
/usr/local/include/glibmm-2.4/glibmm/ustring.h53::1654  Stringify(const ustring::Stringify&) = delete;21:
:48                                                        ^ :
warning : warningalias declarations are a C++11 extension [-Wc++11-extensions]: 
deleted function definitions are a C++11 extension [-Wc++11-extensions]/usr/local/include/glibmm-2.4/glibmm/ustring.h
  using ThrowFunc = void(*)(GError*);:
1345                    ^bool operator>=(int lhs, const ustring& rhs) = delete;:

77                                               ^:
 warning: deleted function definitions are a C++11 extension [-Wc++11-extensions]
  Stringify& operator=(const ustring::Stringify&) = delete;
                                                                            ^
In file included from enums.cc:3:
In file included from ../../libgnomeprint/libgnomeprintmm/enums.h:6:
In file included from /usr/local/include/glibmm-2.4/glibmm.h:88:
In file included from /usr/local/include/glibmm-2.4/glibmm/thread.h:47:
In file included from /usr/local/include/glibmm-2.4/glibmm/error.h:22:
/usr/local/include/glibmm-2.4/glibmm/exception.h:30:23: error: expected ';' at end of declaration list
  virtual ~Exception() noexcept = 0;
                      ^
                      ;
In file included from enums.cc:3:
In file included from ../../libgnomeprint/libgnomeprintmm/enums.h:6:
In file included from /usr/local/include/glibmm-2.4/glibmm.h:88:
In file included from /usr/local/include/glibmm-2.4/glibmm/thread.h:47:
/usr/local/include/glibmm-2.4/glibmm/error.h:38:11: error: expected ';' at end of declaration list
  ~Error() noexcept override;
          ^
          ;
/usr/local/include/glibmm-2.4/glibmm/error.h:42:30: warning: 'override' keyword is a C++11 extension [-Wc++11-extensions]
  Glib::ustring what() const override;
                             ^
/usr/local/include/glibmm-2.4/glibmm/error.h:53:21: warning: alias declarations are a C++11 extension [-Wc++11-extensions]
  using ThrowFunc = void(*)(GError*);
                    ^
/usr/local/include/glibmm-2.4/glibmm/ustring.h:1643:48: warning: deleted function definitions are a C++11 extension [-Wc++11-extensions]
bool operator==(const ustring& lhs, int rhs) = delete;
                                               ^
/usr/local/include/glibmm-2.4/glibmm/ustring.h:1644:48: warning: deleted function definitions are a C++11 extension [-Wc++11-extensions]
bool operator==(int lhs, const ustring& rhs) = delete;
                                               ^
/usr/local/include/glibmm-2.4/glibmm/ustring.h:1645:48: warning: deleted function definitions are a C++11 extension [-Wc++11-extensions]
bool operator!=(const ustring& lhs, int rhs) = delete;
                                               ^
/usr/local/include/glibmm-2.4/glibmm/ustring.h:1646:48: warning: deleted function definitions are a C++11 extension [-Wc++11-extensions]
bool operator!=(int lhs, const ustring& rhs) = delete;
                                               ^
/usr/local/include/glibmm-2.4/glibmm/ustring.h:1647:47: warning: deleted function definitions are a C++11 extension [-Wc++11-extensions]
bool operator<(const ustring& lhs, int rhs) = delete;
                                              ^
/usr/local/include/glibmm-2.4/glibmm/ustring.h:1648:47: warning: deleted function definitions are a C++11 extension [-Wc++11-extensions]
bool operator<(int lhs, const ustring& rhs) = delete;
                                              ^
/usr/local/include/glibmm-2.4/glibmm/ustring.h:1649:47: warning: deleted function definitions are a C++11 extension [-Wc++11-extensions]
bool operator>(const ustring& lhs, int rhs) = delete;
                                              ^
/usr/local/include/glibmm-2.4/glibmm/ustring.h:1650:47: warning: deleted function definitions are a C++11 extension [-Wc++11-extensions]
bool operator>(int lhs, const ustring& rhs) = delete;
                                              ^
/usr/local/include/glibmm-2.4/glibmm/ustring.h:1651:48: warning: deleted function definitions are a C++11 extension [-Wc++11-extensions]
bool operator<=(const ustring& lhs, int rhs) = delete;
                                               ^
/usr/local/include/glibmm-2.4/glibmm/ustring.h:1652:48: warning: deleted function definitions are a C++11 extension [-Wc++11-extensions]
bool operator<=(int lhs, const ustring& rhs) = delete;
                                               ^
/usr/local/include/glibmm-2.4/glibmm/ustring.h:1653:48: warning: deleted function definitions are a C++11 extension [-Wc++11-extensions]
bool operator>=(const ustring& lhs, int rhs) = delete;
                                               ^
/usr/local/include/glibmm-2.4/glibmm/ustring.h:1654:48: warning: deleted function definitions are a C++11 extension [-Wc++11-extensions]
bool operator>=(int lhs, const ustring& rhs) = delete;
                                               ^
In file included from job.cc:3:
In file included from ../../libgnomeprint/libgnomeprintmm/job.h:6:
In file included from /usr/local/include/glibmm-2.4/glibmm.h:88:
In file included from /usr/local/include/glibmm-2.4/glibmm/thread.h:47:
In file included from /usr/local/include/glibmm-2.4/glibmm/error.h:22:
/usr/local/include/glibmm-2.4/glibmm/exception.h:30:23: error: expected ';' at end of declaration list
  virtual ~Exception() noexcept = 0;
                      ^
                      ;
In file included from job.cc:3:
In file included from ../../libgnomeprint/libgnomeprintmm/job.h:6:
In file included from /usr/local/include/glibmm-2.4/glibmm.h:88:
In file included from /usr/local/include/glibmm-2.4/glibmm/thread.h:47:
/usr/local/include/glibmm-2.4/glibmm/error.h:38:11: error: expected ';' at end of declaration list
  ~Error() noexcept override;
          ^
          ;
/usr/local/include/glibmm-2.4/glibmm/error.h:42:30: warning: 'override' keyword is a C++11 extension [-Wc++11-extensions]
  Glib::ustring what() const override;
                             ^
/usr/local/include/glibmm-2.4/glibmm/error.h:53:21: warning: alias declarations are a C++11 extension [-Wc++11-extensions]
  using ThrowFunc = void(*)(GError*);
                    ^
In file included from font.cc:3:
In file included from ../../libgnomeprint/libgnomeprintmm/font.h:6:
In file included from /usr/local/include/glibmm-2.4/glibmm.h:88:
In file included from /usr/local/include/glibmm-2.4/glibmm/thread.h:49:
In file included from /usr/local/include/sigc++-2.0/sigc++/sigc++.h:104:
In file included from /usr/local/include/sigc++-2.0/sigc++/signal.h:8:
In file included from /usr/local/include/sigc++-2.0/sigc++/signal_base.h:25:
/usr/local/include/sigc++-2.0/sigc++/type_traits.h:63:27: warning: alias declarations are a C++11 extension [-Wc++11-extensions]
using type_trait_pass_t = typename type_trait::pass;
                          ^
/usr/local/include/sigc++-2.0/sigc++/type_traits.h:66:27: warning: alias declarations are a C++11 extension [-Wc++11-extensions]
using type_trait_take_t = typename type_trait::take;
                          ^
In file included from font.cc:3:
In file included from ../../libgnomeprint/libgnomeprintmm/font.h:6:
In file included from /usr/local/include/glibmm-2.4/glibmm.h:88:
In file included from /usr/local/include/glibmm-2.4/glibmm/thread.h:49:
In file included from /usr/local/include/sigc++-2.0/sigc++/sigc++.h:104:
In file included from /usr/local/include/sigc++-2.0/sigc++/signal.h:8:
In file included from /usr/local/include/sigc++-2.0/sigc++/signal_base.h:26:
/usr/local/include/sigc++-2.0/sigc++/trackable.h:40:59: error: expected ';' at end of declaration list
  trackable_callback(void* data, func_destroy_notify func) noexcept
                                                          ^
                                                          ;
/usr/local/include/sigc++-2.0/sigc++/trackable.h:71:65: warning: deleted function definitions are a C++11 extension [-Wc++11-extensions]
  trackable_callback_list(const trackable_callback_list& src) = delete;
                                                                ^
/usr/local/include/sigc++-2.0/sigc++/trackable.h:72:76: warning: deleted function definitions are a C++11 extension [-Wc++11-extensions]
  trackable_callback_list& operator=(const trackable_callback_list& src) = delete;
                                                                           ^
/usr/local/include/sigc++-2.0/sigc++/trackable.h:73:50: warning: rvalue references are a C++11 extension [-Wc++11-extensions]
  trackable_callback_list(trackable_callback_list&& src) = delete;
                                                 ^
/usr/local/include/sigc++-2.0/sigc++/trackable.h:73:60: warning: deleted function definitions are a C++11 extension [-Wc++11-extensions]
  trackable_callback_list(trackable_callback_list&& src) = delete;
                                                           ^
/usr/local/include/sigc++-2.0/sigc++/trackable.h:74:61: warning: rvalue references are a C++11 extension [-Wc++11-extensions]
  trackable_callback_list& operator=(trackable_callback_list&& src) = delete;
                                                            ^
/usr/local/include/sigc++-2.0/sigc++/trackable.h:74:71: warning: deleted function definitions are a C++11 extension [-Wc++11-extensions]
  trackable_callback_list& operator=(trackable_callback_list&& src) = delete;
                                                                      ^
/usr/local/include/sigc++-2.0/sigc++/trackable.h:116:14: error: expected ';' at end of declaration list
  trackable() noexcept;
             ^
             ;
/usr/local/include/sigc++-2.0/sigc++/trackable.h:118:34: error: expected ';' at end of declaration list
  trackable(const trackable& src) noexcept;
                                 ^
                                 ;
/usr/local/include/sigc++-2.0/sigc++/trackable.h:120:22: warning: rvalue references are a C++11 extension [-Wc++11-extensions]
  trackable(trackable&& src);
                     ^
/usr/local/include/sigc++-2.0/sigc++/trackable.h:124:33: warning: rvalue references are a C++11 extension [-Wc++11-extensions]
  trackable& operator=(trackable&& src);
                                ^
In file included from enums.cc:3:
In file included from ../../libgnomeprint/libgnomeprintmm/enums.h:6:
In file included from /usr/local/include/glibmm-2.4/glibmm.h:88:
In file included from /usr/local/include/glibmm-2.4/glibmm/thread.h:49:
In file included from /usr/local/include/sigc++-2.0/sigc++/sigc++.h:104:
In file included from /usr/local/include/sigc++-2.0/sigc++/signal.h:8:
In file included from /usr/local/include/sigc++-2.0/sigc++/signal_base.h:25:
/usr/local/include/sigc++-2.0/sigc++/type_traits.h:63:27: warning: alias declarations are a C++11 extension [-Wc++11-extensions]
using type_trait_pass_t = typename type_trait::pass;
                          ^
/usr/local/include/sigc++-2.0/sigc++/type_traits.h:66:27: warning: alias declarations are a C++11 extension [-Wc++11-extensions]
using type_trait_take_t = typename type_trait::take;
                          ^
In file included from enums.cc:3:
In file included from ../../libgnomeprint/libgnomeprintmm/enums.h:6:
In file included from /usr/local/include/glibmm-2.4/glibmm.h:88:
In file included from /usr/local/include/glibmm-2.4/glibmm/thread.h:49:
In file included from /usr/local/include/sigc++-2.0/sigc++/sigc++.h:104:
In file included from /usr/local/include/sigc++-2.0/sigc++/signal.h:8:
In file included from /usr/local/include/sigc++-2.0/sigc++/signal_base.h:26:
/usr/local/include/sigc++-2.0/sigc++/trackable.h:40:59: error: expected ';' at end of declaration list
  trackable_callback(void* data, func_destroy_notify func) noexcept
                                                          ^
                                                          ;
/usr/local/include/sigc++-2.0/sigc++/trackable.h:71:65: warning: deleted function definitions are a C++11 extension [-Wc++11-extensions]
  trackable_callback_list(const trackable_callback_list& src) = delete;
                                                                ^
/usr/local/include/sigc++-2.0/sigc++/trackable.h:72:76: warning: deleted function definitions are a C++11 extension [-Wc++11-extensions]
  trackable_callback_list& operator=(const trackable_callback_list& src) = delete;
                                                                           ^
/usr/local/include/sigc++-2.0/sigc++/trackable.h:73:50: warning: rvalue references are a C++11 extension [-Wc++11-extensions]
  trackable_callback_list(trackable_callback_list&& src) = delete;
                                                 ^
/usr/local/include/sigc++-2.0/sigc++/trackable.h:73:60: warning: deleted function definitions are a C++11 extension [-Wc++11-extensions]
  trackable_callback_list(trackable_callback_list&& src) = delete;
                                                           ^
/usr/local/include/sigc++-2.0/sigc++/trackable.h:74:61: warning: rvalue references are a C++11 extension [-Wc++11-extensions]
  trackable_callback_list& operator=(trackable_callback_list&& src) = delete;
                                                            ^
/usr/local/include/sigc++-2.0/sigc++/trackable.h:74:71: warning: deleted function definitions are a C++11 extension [-Wc++11-extensions]
  trackable_callback_list& operator=(trackable_callback_list&& src) = delete;
                                                                      ^
In file included from job.cc:3:
In file included from ../../libgnomeprint/libgnomeprintmm/job.h:6:
In file included from /usr/local/include/glibmm-2.4/glibmm.h:88:
In file included from /usr/local/include/glibmm-2.4/glibmm/thread.h:49:
In file included from /usr/local/include/sigc++-2.0/sigc++/sigc++.h:104:
In file included from /usr/local/include/sigc++-2.0/sigc++/signal.h:8:
In file included from /usr/local/include/sigc++-2.0/sigc++/signal_base.h:25:
/usr/local/include/sigc++-2.0/sigc++/type_traits.h:63:27: warning: alias declarations are a C++11 extension [-Wc++11-extensions]
using type_trait_pass_t = typename type_trait::pass;
                          ^
/usr/local/include/sigc++-2.0/sigc++/type_traits.h:66:27: warning: alias declarations are a C++11 extension [-Wc++11-extensions]
using type_trait_take_t = typename type_trait::take;
                          ^
In file included from job.cc:3:
In file included from ../../libgnomeprint/libgnomeprintmm/job.h:6:
In file included from /usr/local/include/glibmm-2.4/glibmm.h:88:
In file included from /usr/local/include/glibmm-2.4/glibmm/thread.h:49:
In file included from /usr/local/include/sigc++-2.0/sigc++/sigc++.h:104:
In file included from /usr/local/include/sigc++-2.0/sigc++/signal.h:8:
In file included from /usr/local/include/sigc++-2.0/sigc++/signal_base.h:26:
/usr/local/include/sigc++-2.0/sigc++/trackable.h:40:59: error: In file included from private.cc:18:
In file included from ../../libgnomeprint/libgnomeprintmm/private.hexpected ';' at end of declaration list
:22:
In file included from /usr/local/include/glibmm-2.4/glibmm.h:88:
In file included from /usr/local/include/glibmm-2.4/glibmm/thread.h:49:
In file included from /usr/local/include/sigc++-2.0/sigc++/sigc++.h:104:
In file included from /usr/local/include/sigc++-2.0/sigc++/signal.h:8:
In file included from /usr/local/include/sigc++-2.0/sigc++/signal_base.h:27:
In file included from /usr/local/include/sigc++-2.0/sigc++/functors/slot.h:7:
In file included from /usr/local/include/sigc++-2.0/sigc++/adaptors/adaptor_trait.h:10:
/usr/local/include/sigc++-2.0/sigc++/adaptors/deduce_result_type.h:48:32: warning: variadic templates are a C++11 extension [-Wc++11-extensions]
  trackable_callback(void* data, func_destroy_notify func) noexcept
                                                          ^
                                                          ;
template
                               ^
/usr/local/include/sigc++-2.0/sigc++/trackable.h:/usr/local/include/sigc++-2.0/sigc++/adaptors/deduce_result_type.h:53:29: warning: default template arguments for a function template are a C++11 extension [-Wc++11-extensions]
71:65: warning: deleted function definitions are a C++11 extension [-Wc++11-extensions]
  template::type>
                            ^          ~~~~~~~~~~~~~~~~~~~~~~~~~~~~~~~~~~~~~~~~~~~~~~~~~~~~~~~
  trackable_callback_list(const trackable_callback_list& src) = delete;
                                                                ^
/usr/local/include/sigc++-2.0/sigc++/adaptors/deduce_result_type.h:64:16: warning: alias declarations are a C++11 extension [-Wc++11-extensions]
/usr/local/include/sigc++-2.0/sigc++/trackable.h:72:76: warning: deleted function definitions are a C++11 extension [-Wc++11-extensions]
  using type = decltype (test ());
               ^
  trackable_callback_list& operator=(const trackable_callback_list& src) = delete;
                                                                           ^
/usr/include/c++/v1/__config:561:21: note: expanded from macro 'decltype'
/usr/local/include/sigc++-2.0/sigc++/trackable.h:73:50: warning: rvalue references are a C++11 extension [-Wc++11-extensions]
#define decltype(x) __typeof__(x)
                    ^  trackable_callback_list(trackable_callback_list&& src) = delete;
                                                 ^

/usr/local/include/sigc++-2.0/sigc++/trackable.h:73:60: warning: deleted function definitions are a C++11 extension [-Wc++11-extensions]
In file included from private.cc:18:
In file included from ../../libgnomeprint/libgnomeprintmm/private.h:22:
In file included from /usr/local/include/glibmm-2.4/glibmm.h:88:
In file included from /usr/local/include/glibmm-2.4/glibmm/thread.h:49:
In file included from /usr/local/include/sigc++-2.0/sigc++/sigc++.h:104:
In file included from /usr/local/include/sigc++-2.0/sigc++/signal.h:/usr/local/include/sigc++-2.0/sigc++/trackable.h8::
116In file included from :/usr/local/include/sigc++-2.0/sigc++/signal_base.h14::27 :
errorIn file included from : /usr/local/include/sigc++-2.0/sigc++/functors/slot.hexpected ';' at end of declaration list:
7  trackable() noexcept;:

In file included from              ^/usr/local/include/sigc++-2.0/sigc++/adaptors/adaptor_trait.h
:             ;10
:
/usr/local/include/sigc++-2.0/sigc++/adaptors/deduce_result_type.h:67:/usr/local/include/sigc++-2.0/sigc++/trackable.h38::118 :warning34: :variadic templates are a C++11 extension [-Wc++11-extensions] 
error:   trackable_callback_list(trackable_callback_list&& src) = delete;expected ';' at end of declaration list

                                                           ^template

/usr/local/include/sigc++-2.0/sigc++/trackable.h                                     ^:
74:61: warning/usr/local/include/sigc++-2.0/sigc++/adaptors/deduce_result_type.h: :rvalue references are a C++11 extension [-Wc++11-extensions]68
:25: warning  trackable(const trackable& src) noexcept;: 
alias declarations are a C++11 extension [-Wc++11-extensions]                                 ^

                                 ;
  trackable_callback_list& operator=(trackable_callback_list&& src) = delete;using deduce_result_t = typename deduce_result_type::type;

                                                            ^/usr/local/include/sigc++-2.0/sigc++/trackable.h
:120:22:                        ^ 
warning: rvalue references are a C++11 extension [-Wc++11-extensions]
/usr/local/include/sigc++-2.0/sigc++/trackable.h  trackable(trackable&& src);
                     ^
:74:71:/usr/local/include/sigc++-2.0/sigc++/trackable.h:124:33: warning: rvalue references are a C++11 extension [-Wc++11-extensions]
  trackable& operator=(trackable&& src);
                                ^
 warning: deleted function definitions are a C++11 extension [-Wc++11-extensions]
  trackable_callback_list& operator=(trackable_callback_list&& src) = delete;
                                                                      ^
In file included from private.cc:18:
In file included from ../../libgnomeprint/libgnomeprintmm/private.h:22:
In file included from /usr/local/include/glibmm-2.4/glibmm.h:88:
In file included from /usr/local/include/glibmm-2.4/glibmm/thread.h:49:
In file included from /usr/local/include/sigc++-2.0/sigc++/sigc++.h:104:
In file included from /usr/local/include/sigc++-2.0/sigc++/signal.h:8:
In file included from /usr/local/include/sigc++-2.0/sigc++/signal_base.h:27:
In file included from /usr/local/include/sigc++-2.0/sigc++/functors/slot.h:8:
/usr/local/include/sigc++-2.0/sigc++/functors/slot_base.h:57:35: warning: deleted function definitions are a C++11 extension [-Wc++11-extensions]
  slot_rep(const slot_rep& src) = delete;
                                  ^
/usr/local/include/sigc++-2.0/sigc++/functors/slot_base.h:58:46: warning: deleted function definitions are a C++11 extension [-Wc++11-extensions]
  slot_rep& operator=(const slot_rep& src) = delete;
                                             ^
/usr/local/include/sigc++-2.0/sigc++/functors/slot_base.h:60:20: warning: rvalue references are a C++11 extension [-Wc++11-extensions]
  slot_rep(slot_rep&& src) = delete;
                   ^
/usr/local/include/sigc++-2.0/sigc++/functors/slot_base.h:60:30: warning: deleted function definitions are a C++11 extension [-Wc++11-extensions]
  slot_rep(slot_rep&& src) = delete;
                             ^
/usr/local/include/sigc++-2.0/sigc++/functors/slot_base.h:61:31: warning: rvalue references are a C++11 extension [-Wc++11-extensions]
  slot_rep& operator=(slot_rep&& src) = delete;
                              ^
/usr/local/include/sigc++-2.0/sigc++/functors/slot_base.h:61:41: warning: deleted function definitions are a C++11 extension [-Wc++11-extensions]
  slot_rep& operator=(slot_rep&& src) = delete;
                                        ^
/usr/local/include/sigc++-2.0/sigc++/functors/slot_base.h:91:59: error: expected ';' at end of declaration list
  inline slot_rep(hook call__, hook destroy__, hook dup__) noexcept
                                                          ^
                                                          ;
/usr/local/include/sigc++-2.0/sigc++/functors/slot_base.h:150:37: error: expected ';' at end of declaration list
  inline slot_do_bind(slot_rep* rep) noexcept : rep_(rep) {}
                                    ^
                                    ;
/usr/local/include/sigc++-2.0/sigc++/functors/slot_base.h:168:39: error: expected ';' at end of declaration list
  inline slot_do_unbind(slot_rep* rep) noexcept : rep_(rep) {}
                                      ^
                                      ;
In file included from wrap_init.cc:11:
/usr/local/include/sigc++-2.0/sigc++/functors/slot_base.h:273:14: error: expected ';' at end of declaration list
In file included from /usr/local/include/glibmm-2.4/glibmm/object.h:29:
In file included from /usr/local/include/glibmm-2.4/glibmm/objectbase.h:21:
/usr/local/include/glibmm-2.4/glibmm/class.h:69:39: warning: alias declarations are a C++11 extension [-Wc++11-extensions]
  slot_base() noexcept;
             ^
             ;
  using interface_class_vector_type = std::vector;
                                      ^
/usr/local/include/sigc++-2.0/sigc++/functors/slot_base.h:278:36: error: expected ';' at end of declaration list
  explicit slot_base(rep_type* rep) noexcept;
/usr/local/include/glibmm-2.4/glibmm/class.h:105:33: warning: alias declarations are a C++11 extension [-Wc++11-extensions]
                                   ^
                                   ;
  using iface_properties_type = std::vector;
                                ^
/usr/local/include/sigc++-2.0/sigc++/functors/slot_base.h:289:22: warning: rvalue references are a C++11 extension [-Wc++11-extensions]
  slot_base(slot_base&& src);
                     ^
/usr/local/include/sigc++-2.0/sigc++/functors/slot_base.h:300:3: warning: explicit conversion functions are a C++11 extension [-Wc++11-extensions]
  explicit operator bool() const noexcept;
  ^~~~~~~~
/usr/local/include/sigc++-2.0/sigc++/functors/slot_base.h:300:33: error: expected ';' at end of declaration list
  explicit operator bool() const noexcept;
                                ^
                                ;
/usr/local/include/sigc++-2.0/sigc++/functors/slot_base.h:309:63: error: expected ';' at end of declaration list
  void set_parent(void* parent, void* (*cleanup)(void*)) const noexcept;
                                                              ^
                                                              ;
/usr/local/include/sigc++-2.0/sigc++/functors/slot_base.h:328:28: error: expected ';' at end of declaration list
  inline bool empty() const noexcept
                           ^
                           ;
/usr/local/include/sigc++-2.0/sigc++/functors/slot_base.h:350:17: error: expected ';' at end of declaration list
  bool unblock() noexcept;
                ^
                ;
/usr/local/include/sigc++-2.0/sigc++/functors/slot_base.h:371:33: warning: rvalue references are a C++11 extension [-Wc++11-extensions]
  slot_base& operator=(slot_base&& src);
                                ^
In file included from private.cc:18:
In file included from ../../libgnomeprint/libgnomeprintmm/private.h:22:
In file included from /usr/local/include/glibmm-2.4/glibmm.h:88:
In file included from /usr/local/include/glibmm-2.4/glibmm/thread.h:49:
In file included from /usr/local/include/sigc++-2.0/sigc++/sigc++.h:104:
In file included from /usr/local/include/sigc++-2.0/sigc++/signal.h:8:
In file included from /usr/local/include/sigc++-2.0/sigc++/signal_base.h:27:
/usr/local/include/sigc++-2.0/sigc++/functors/slot.h:74:58: warning: deleted function definitions are a C++11 extension [-Wc++11-extensions]
  typed_slot_rep& operator=(const typed_slot_rep& src) = delete;
                                                         ^
/usr/local/include/sigc++-2.0/sigc++/functors/slot.h:76:32: warning: rvalue references are a C++11 extension [-Wc++11-extensions]
  typed_slot_rep(typed_slot_rep&& src) = delete;
                               ^
/usr/local/include/sigc++-2.0/sigc++/functors/slot.h:76:42: warning: deleted function definitions are a C++11 extension [-Wc++11-extensions]
  typed_slot_rep(typed_slot_rep&& src) = delete;
                                         ^
/usr/local/include/sigc++-2.0/sigc++/functors/slot.h:77:43: warning: rvalue references are a C++11 extension [-Wc++11-extensions]
  typed_slot_rep& operator=(typed_slot_rep&& src) = delete;
                                          ^
/usr/local/include/sigc++-2.0/sigc++/functors/slot.h:77:53: warning: /usr/local/include/sigc++-2.0/sigc++/trackable.h:116:14: error: expected ';' at end of declaration list
deleted function definitions are a C++11 extension [-Wc++11-extensions]  trackable() noexcept;
             ^
             ;

/usr/local/include/sigc++-2.0/sigc++/trackable.h  typed_slot_rep& operator=(typed_slot_rep&& src) = delete;
                                                    ^
:118:34: error: expected ';' at end of declaration list
  trackable(const trackable& src) noexcept;
                                 ^
                                 ;
In file included from config.cc:3:
/usr/local/include/sigc++-2.0/sigc++/trackable.h:120:22: warning: rvalue references are a C++11 extension [-Wc++11-extensions]
In file included from ../../libgnomeprint/libgnomeprintmm/config.h:6:
In file included from /usr/local/include/glibmm-2.4/glibmm.h:88:
In file included from /usr/local/include/glibmm-2.4/glibmm/thread.h:49:
In file included from /usr/local/include/sigc++-2.0/sigc++/sigc++.h:104:
In file included from /usr/local/include/sigc++-2.0/sigc++/signal.h:8:
/usr/local/include/sigc++-2.0/sigc++/functors/slot.h:  trackable(trackable&& src);
169                     ^:
In file included from /usr/local/include/sigc++-2.0/sigc++/signal_base.h:27:
/usr/local/include/sigc++-2.0/sigc++/trackable.h:In file included from 124/usr/local/include/sigc++-2.0/sigc++/functors/slot.h::337:
:In file included from  /usr/local/include/sigc++-2.0/sigc++/adaptors/adaptor_trait.hwarning:: 10:
rvalue references are a C++11 extension [-Wc++11-extensions]97
:   trackable& operator=(trackable&& src);
                                ^
/usr/local/include/sigc++-2.0/sigc++/adaptors/deduce_result_type.h:48:32: warning: variadic templates are a C++11 extension [-Wc++11-extensions]
error: a space is required between consecutive right angle brackets (use '> >')
template
                               ^
      return (typed_rep->functor_).SIGC_WORKAROUND_OPERATOR_PARENTHESES>
                                                                                                ^~
                                                                                                > >
/usr/local/include/sigc++-2.0/sigc++/adaptors/deduce_result_type.h:53:29: warning: default template arguments for a function template are a C++11 extension [-Wc++11-extensions]
  template::type>
                            ^          ~~~~~~~~~~~~~~~~~~~~~~~~~~~~~~~~~~~~~~~~~~~~~~~~~~~~~~~
/usr/local/include/sigc++-2.0/sigc++/functors/slot.h:205:124: error: a space is required between consecutive right angle brackets (use '> >')
/usr/local/include/sigc++-2.0/sigc++/adaptors/deduce_result_type.h:64:16: warning: alias declarations are a C++11 extension [-Wc++11-extensions]
      return (typed_rep->functor_).SIGC_WORKAROUND_OPERATOR_PARENTHESES, type_trait_take_t>
                                                                                                                           ^~  using type = decltype (test ());
               ^

                                                                                                                           > >
/usr/include/c++/v1/__config:561:21: note: expanded from macro 'decltype'
#define decltype(x) __typeof__(x)
                    ^
In file included from config.cc:3:
In file included from ../../libgnomeprint/libgnomeprintmm/config.h:6:
/usr/local/include/sigc++-2.0/sigc++/functors/slot.h:243:151: error: a space is required between consecutive right angle brackets (use '> >')
In file included from /usr/local/include/glibmm-2.4/glibmm.h:88:
In file included from /usr/local/include/glibmm-2.4/glibmm/thread.h:49:
      return (typed_rep->functor_).SIGC_WORKAROUND_OPERATOR_PARENTHESES, type_trait_take_t, type_trait_take_t>
                                                                                                                                                      ^~
                                                                                                                                                      > >
In file included from /usr/local/include/sigc++-2.0/sigc++/sigc++.h:104:
In file included from /usr/local/include/sigc++-2.0/sigc++/signal.h:8:
In file included from /usr/local/include/sigc++-2.0/sigc++/signal_base.h:27:
In file included from /usr/local/include/sigc++-2.0/sigc++/functors/slot.h:7:
In file included from /usr/local/include/sigc++-2.0/sigc++/adaptors/adaptor_trait.h:10:
/usr/local/include/sigc++-2.0/sigc++/adaptors/deduce_result_type.h:67:38: fatal error: too many errors emitted, stopping now [-ferror-limit=]
warning: variadic templates are a C++11 extension [-Wc++11-extensions]
template
                                     ^
/usr/local/include/sigc++-2.0/sigc++/adaptors/deduce_result_type.h:68:25: warning: alias declarations are a C++11 extension [-Wc++11-extensions]
using deduce_result_t = typename deduce_result_type::type;
                        ^
In file included from config.cc:3:
In file included from ../../libgnomeprint/libgnomeprintmm/config.h:6:
In file included from /usr/local/include/glibmm-2.4/glibmm.h:88:
In file included from /usr/local/include/glibmm-2.4/glibmm/thread.h:49:
In file included from /usr/local/include/sigc++-2.0/sigc++/sigc++.h:104:
In file included from /usr/local/include/sigc++-2.0/sigc++/signal.h:8:
In file included from /usr/local/include/sigc++-2.0/sigc++/signal_base.h:27:
In file included from /usr/local/include/sigc++-2.0/sigc++/functors/slot.h:8:
/usr/local/include/sigc++-2.0/sigc++/functors/slot_base.h:57:35: warning: deleted function definitions are a C++11 extension [-Wc++11-extensions]
  slot_rep(const slot_rep& src) = delete;
                                  ^
/usr/local/include/sigc++-2.0/sigc++/functors/slot_base.h:58:46: warning: deleted function definitions are a C++11 extension [-Wc++11-extensions]
  slot_rep& operator=(const slot_rep& src) = delete;
                                             ^
/usr/local/include/sigc++-2.0/sigc++/functors/slot_base.h:60:20: warning: rvalue references are a C++11 extension [-Wc++11-extensions]
  slot_rep(slot_rep&& src) = delete;
                   ^
/usr/local/include/sigc++-2.0/sigc++/functors/slot_base.h:60:30: warning: deleted function definitions are a C++11 extension [-Wc++11-extensions]
  slot_rep(slot_rep&& src) = delete;
                             ^
/usr/local/include/sigc++-2.0/sigc++/functors/slot_base.h:61:31: warning: rvalue references are a C++11 extension [-Wc++11-extensions]
  slot_rep& operator=(slot_rep&& src) = delete;
                              ^
/usr/local/include/sigc++-2.0/sigc++/functors/slot_base.h:61:41: warning: deleted function definitions are a C++11 extension [-Wc++11-extensions]
  slot_rep& operator=(slot_rep&& src) = delete;
                                        ^
/usr/local/include/sigc++-2.0/sigc++/functors/slot_base.h:91:59: error: expected ';' at end of declaration list
  inline slot_rep(hook call__, hook destroy__, hook dup__) noexcept
                                                          ^
                                                          ;
/usr/local/include/sigc++-2.0/sigc++/functors/slot_base.h:150:37: error: expected ';' at end of declaration list
  inline slot_do_bind(slot_rep* rep) noexcept : rep_(rep) {}
                                    ^
                                    ;
/usr/local/include/sigc++-2.0/sigc++/functors/slot_base.h:168:39: error: expected ';' at end of declaration list
  inline slot_do_unbind(slot_rep* rep) noexcept : rep_(rep) {}
                                      ^
                                      ;
/usr/local/include/sigc++-2.0/sigc++/functors/slot_base.h:273:14: error: expected ';' at end of declaration list
  slot_base() noexcept;
             ^
             ;
/usr/local/include/sigc++-2.0/sigc++/functors/slot_base.h:278:36: error: expected ';' at end of declaration list
  explicit slot_base(rep_type* rep) noexcept;
                                   ^
                                   ;
/usr/local/include/sigc++-2.0/sigc++/functors/slot_base.h:289:22: warning: rvalue references are a C++11 extension [-Wc++11-extensions]
  slot_base(slot_base&& src);
                     ^
/usr/local/include/sigc++-2.0/sigc++/functors/slot_base.h:300:3: warning: explicit conversion functions are a C++11 extension [-Wc++11-extensions]
  explicit operator bool() const noexcept;
  ^~~~~~~~
/usr/local/include/sigc++-2.0/sigc++/functors/slot_base.h:300:33: error: expected ';' at end of declaration list
  explicit operator bool() const noexcept;
                                ^
                                ;
/usr/local/include/sigc++-2.0/sigc++/functors/slot_base.h:309:63: error: expected ';' at end of declaration list
  void set_parent(void* parent, void* (*cleanup)(void*)) const noexcept;
                                                              ^
                                                              ;
/usr/local/include/sigc++-2.0/sigc++/functors/slot_base.h:328:28: error: expected ';' at end of declaration list
  inline bool empty() const noexcept
                           ^
                           ;
/usr/local/include/sigc++-2.0/sigc++/functors/slot_base.h:350:17: error: expected ';' at end of declaration list
  bool unblock() noexcept;
                ^
                ;
/usr/local/include/sigc++-2.0/sigc++/functors/slot_base.h:371:33: warning: rvalue references are a C++11 extension [-Wc++11-extensions]
  slot_base& operator=(slot_base&& src);
                                ^
In file included from config.cc:3:
In file included from ../../libgnomeprint/libgnomeprintmm/config.h:6:
In file included from /usr/local/include/glibmm-2.4/glibmm.h:88:
In file included from /usr/local/include/glibmm-2.4/glibmm/thread.h:49:
In file included from /usr/local/include/sigc++-2.0/sigc++/sigc++.h:104:
In file included from /usr/local/include/sigc++-2.0/sigc++/signal.h:8:
In file included from /usr/local/include/sigc++-2.0/sigc++/signal_base.h:27:
/usr/local/include/sigc++-2.0/sigc++/functors/slot.h:74:58: warning: deleted function definitions are a C++11 extension [-Wc++11-extensions]
  typed_slot_rep& operator=(const typed_slot_rep& src) = delete;
                                                         ^
/usr/local/include/sigc++-2.0/sigc++/functors/slot.h:76:32: warning: rvalue references are a C++11 extension [-Wc++11-extensions]
  typed_slot_rep(typed_slot_rep&& src) = delete;
                               ^
/usr/local/include/sigc++-2.0/sigc++/functors/slot.h:76:42: warning: deleted function definitions are a C++11 extension [-Wc++11-extensions]
  typed_slot_rep(typed_slot_rep&& src) = delete;
                                         ^
/usr/local/include/sigc++-2.0/sigc++/functors/slot.h:77:43: warning: rvalue references are a C++11 extension [-Wc++11-extensions]
  typed_slot_rep& operator=(typed_slot_rep&& src) = delete;
                                          ^
/usr/local/include/sigc++-2.0/sigc++/functors/slot.h:77:53: warning: deleted function definitions are a C++11 extension [-Wc++11-extensions]
  typed_slot_rep& operator=(typed_slot_rep&& src) = delete;
                                                    ^
In file included from wrap_init.cc:11:
In file included from /usr/local/include/glibmm-2.4/glibmm/object.h:29:
In file included from /usr/local/include/glibmm-2.4/glibmm/objectbase.h:22:
In file included from /usr/local/include/glibmm-2.4/glibmm/signalproxy.h:27:
In file included from /usr/local/include/sigc++-2.0/sigc++/sigc++.h:104:
In file included from /usr/local/include/sigc++-2.0/sigc++/signal.h:8:
In file included from /usr/local/include/sigc++-2.0/sigc++/signal_base.h:25:
/usr/local/include/sigc++-2.0/sigc++/type_traits.h:63:27: warning: alias declarations are a C++11 extension [-Wc++11-extensions]
using type_trait_pass_t = typename type_trait::pass;
                          ^
/usr/local/include/sigc++-2.0/sigc++/type_traits.h:66:27: warning: alias declarations are a C++11 extension [-Wc++11-extensions]
/usr/local/include/sigc++-2.0/sigc++/functors/slot.h:169:97: error: a space is required between consecutive right angle brackets (use '> >')
using type_trait_take_t = typename type_trait::take;
                          ^
      return (typed_rep->functor_).SIGC_WORKAROUND_OPERATOR_PARENTHESES>
                                                                                                ^~
                                                                                                > >
In file included from wrap_init.cc:11:
In file included from /usr/local/include/glibmm-2.4/glibmm/object.h:29:
In file included from /usr/local/include/glibmm-2.4/glibmm/objectbase.h:22:
In file included from /usr/local/include/glibmm-2.4/glibmm/signalproxy.h:27:
In file included from /usr/local/include/sigc++-2.0/sigc++/sigc++.h:104:
In file included from /usr/local/include/sigc++-2.0/sigc++/signal.h:8:
In file included from /usr/local/include/sigc++-2.0/sigc++/signal_base.h:26:
/usr/local/include/sigc++-2.0/sigc++/trackable.h:40:59: error: expected ';' at end of declaration list
/usr/local/include/sigc++-2.0/sigc++/functors/slot.h:205:124: error: a space is required between consecutive right angle brackets (use '> >')
  trackable_callback(void* data, func_destroy_notify func) noexcept
                                                          ^
                                                          ;
      return (typed_rep->functor_).SIGC_WORKAROUND_OPERATOR_PARENTHESES, type_trait_take_t>
                                                                                                                           ^~
                                                                                                                           > >
/usr/local/include/sigc++-2.0/sigc++/trackable.h:71:65: warning: deleted function definitions are a C++11 extension [-Wc++11-extensions]
  trackable_callback_list(const trackable_callback_list& src) = delete;
                                                                ^
/usr/local/include/sigc++-2.0/sigc++/trackable.h:72:76: warning: deleted function definitions are a C++11 extension [-Wc++11-extensions]
/usr/local/include/sigc++-2.0/sigc++/functors/slot.h:243:151: error: a space is required between consecutive right angle brackets (use '> >')
  trackable_callback_list& operator=(const trackable_callback_list& src) = delete;
                                                                           ^
/usr/local/include/sigc++-2.0/sigc++/trackable.h:73:50: warning: rvalue references are a C++11 extension [-Wc++11-extensions]
      return (typed_rep->functor_).SIGC_WORKAROUND_OPERATOR_PARENTHESES, type_trait_take_t, type_trait_take_t>
                                                                                                                                                      ^~
  trackable_callback_list(trackable_callback_list&& src) = delete;
                                                 ^
                                                                                                                                                      > >
/usr/local/include/sigc++-2.0/sigc++/trackable.h:73:60: warning: deleted function definitions are a C++11 extension [-Wc++11-extensions]
  trackable_callback_list(trackable_callback_list&& src) = delete;
                                                           ^
/usr/local/include/sigc++-2.0/sigc++/trackable.h:74:61: warning: rvalue references are a C++11 extension [-Wc++11-extensions]fatal error: too many errors emitted, stopping now [-ferror-limit=]

  trackable_callback_list& operator=(trackable_callback_list&& src) = delete;
                                                            ^
/usr/local/include/sigc++-2.0/sigc++/trackable.h:74:71: warning: deleted function definitions are a C++11 extension [-Wc++11-extensions]
  trackable_callback_list& operator=(trackable_callback_list&& src) = delete;
                                                                      ^
In file included from font.cc:3:
In file included from ../../libgnomeprint/libgnomeprintmm/font.h:6:
In file included from /usr/local/include/glibmm-2.4/glibmm.h:88:
In file included from /usr/local/include/glibmm-2.4/glibmm/thread.h:49:
In file included from /usr/local/include/sigc++-2.0/sigc++/sigc++.h:104:
In file included from /usr/local/include/sigc++-2.0/sigc++/signal.h:8:
In file included from /usr/local/include/sigc++-2.0/sigc++/signal_base.h:27:
In file included from /usr/local/include/sigc++-2.0/sigc++/functors/slot.h:7:
In file included from /usr/local/include/sigc++-2.0/sigc++/adaptors/adaptor_trait.h:10:
/usr/local/include/sigc++-2.0/sigc++/adaptors/deduce_result_type.h:48:32: warning: variadic templates are a C++11 extension [-Wc++11-extensions]
template
                               ^
/usr/local/include/sigc++-2.0/sigc++/adaptors/deduce_result_type.h:53:29: warning: default template arguments for a function template are a C++11 extension [-Wc++11-extensions]
  template::type>
                            ^          ~~~~~~~~~~~~~~~~~~~~~~~~~~~~~~~~~~~~~~~~~~~~~~~~~~~~~~~
/usr/local/include/sigc++-2.0/sigc++/adaptors/deduce_result_type.h:64:16: warning: alias declarations are a C++11 extension [-Wc++11-extensions]
  using type = decltype (test ());
               ^
/usr/include/c++/v1/__config:561:21: note: expanded from macro 'decltype'
#define decltype(x) __typeof__(x)
                    ^
In file included from font.cc:3:
In file included from ../../libgnomeprint/libgnomeprintmm/font.h:6:
In file included from /usr/local/include/glibmm-2.4/glibmm.h:88:
In file included from /usr/local/include/glibmm-2.4/glibmm/thread.h:49:
In file included from /usr/local/include/sigc++-2.0/sigc++/sigc++.h:104:
In file included from /usr/local/include/sigc++-2.0/sigc++/signal.h:8:
In file included from /usr/local/include/sigc++-2.0/sigc++/signal_base.h:27:
In file included from /usr/local/include/sigc++-2.0/sigc++/functors/slot.h:7:
In file included from /usr/local/include/sigc++-2.0/sigc++/adaptors/adaptor_trait.h:10:
/usr/local/include/sigc++-2.0/sigc++/adaptors/deduce_result_type.h:67:38: warning: variadic templates are a C++11 extension [-Wc++11-extensions]
template
                                     ^
/usr/local/include/sigc++-2.0/sigc++/adaptors/deduce_result_type.h:68:25: warning: alias declarations are a C++11 extension [-Wc++11-extensions]
using deduce_result_t = typename deduce_result_type::type;
                        ^
/usr/local/include/sigc++-2.0/sigc++/trackable.h:116:14: error: expected ';' at end of declaration list
  trackable() noexcept;
             ^
             ;
/usr/local/include/sigc++-2.0/sigc++/trackable.h:118:34: error: expected ';' at end of declaration list
  trackable(const trackable& src) noexcept;
                                 ^
                                 ;
/usr/local/include/sigc++-2.0/sigc++/trackable.h:120:22: warning: rvalue references are a C++11 extension [-Wc++11-extensions]
  trackable(trackable&& src);
                     ^
/usr/local/include/sigc++-2.0/sigc++/trackable.h:124:33: warning: rvalue references are a C++11 extension [-Wc++11-extensions]
  trackable& operator=(trackable&& src);
                                ^
In file included from font.cc:3:
In file included from ../../libgnomeprint/libgnomeprintmm/font.h:6:
In file included from /usr/local/include/glibmm-2.4/glibmm.h:88:
In file included from /usr/local/include/glibmm-2.4/glibmm/thread.h:49:
In file included from /usr/local/include/sigc++-2.0/sigc++/sigc++.h:104:
In file included from /usr/local/include/sigc++-2.0/sigc++/signal.h:8:
In file included from /usr/local/include/sigc++-2.0/sigc++/signal_base.h:27:
In file included from /usr/local/include/sigc++-2.0/sigc++/functors/slot.h:8:
/usr/local/include/sigc++-2.0/sigc++/functors/slot_base.h:57:35: warning: deleted function definitions are a C++11 extension [-Wc++11-extensions]
  slot_rep(const slot_rep& src) = delete;
                                  ^
/usr/local/include/sigc++-2.0/sigc++/functors/slot_base.h:58:46: warning: deleted function definitions are a C++11 extension [-Wc++11-extensions]
  slot_rep& operator=(const slot_rep& src) = delete;
                                             ^
/usr/local/include/sigc++-2.0/sigc++/functors/slot_base.h:60:20: warning: rvalue references are a C++11 extension [-Wc++11-extensions]
  slot_rep(slot_rep&& src) = delete;
                   ^
/usr/local/include/sigc++-2.0/sigc++/functors/slot_base.h:60:30: warning: deleted function definitions are a C++11 extension [-Wc++11-extensions]
  slot_rep(slot_rep&& src) = delete;
                             ^
/usr/local/include/sigc++-2.0/sigc++/functors/slot_base.h:61:31: warning: rvalue references are a C++11 extension [-Wc++11-extensions]
  slot_rep& operator=(slot_rep&& src) = delete;
                              ^
/usr/local/include/sigc++-2.0/sigc++/functors/slot_base.h:61:41: warning: deleted function definitions are a C++11 extension [-Wc++11-extensions]
  slot_rep& operator=(slot_rep&& src) = delete;
                                        ^
/usr/local/include/sigc++-2.0/sigc++/functors/slot_base.h:91:59: error: expected ';' at end of declaration list
  inline slot_rep(hook call__, hook destroy__, hook dup__) noexcept
                                                          ^
                                                          ;
/usr/local/include/sigc++-2.0/sigc++/functors/slot_base.h:150:37: error: expected ';' at end of declaration list
  inline slot_do_bind(slot_rep* rep) noexcept : rep_(rep) {}
                                    ^
                                    ;
/usr/local/include/sigc++-2.0/sigc++/functors/slot_base.h:168:39: error: expected ';' at end of declaration list
  inline slot_do_unbind(slot_rep* rep) noexcept : rep_(rep) {}
                                      ^
                                      ;
/usr/local/include/sigc++-2.0/sigc++/functors/slot_base.h:273:14: error: expected ';' at end of declaration list
  slot_base() noexcept;
             ^
             ;
/usr/local/include/sigc++-2.0/sigc++/functors/slot_base.h:278:36: error: expected ';' at end of declaration list
  explicit slot_base(rep_type* rep) noexcept;
                                   ^
                                   ;
/usr/local/include/sigc++-2.0/sigc++/functors/slot_base.h:289:22: warning: rvalue references are a C++11 extension [-Wc++11-extensions]
  slot_base(slot_base&& src);
                     ^
/usr/local/include/sigc++-2.0/sigc++/functors/slot_base.h:300:3: warning: explicit conversion functions are a C++11 extension [-Wc++11-extensions]
  explicit operator bool() const noexcept;
  ^~~~~~~~
/usr/local/include/sigc++-2.0/sigc++/functors/slot_base.h:300:33: error: expected ';' at end of declaration list
  explicit operator bool() const noexcept;
                                ^
                                ;
/usr/local/include/sigc++-2.0/sigc++/functors/slot_base.h:309:63: error: expected ';' at end of declaration list
  void set_parent(void* parent, void* (*cleanup)(void*)) const noexcept;
                                                              ^
                                                              ;
/usr/local/include/sigc++-2.0/sigc++/functors/slot_base.h:328:28: error: expected ';' at end of declaration list
  inline bool empty() const noexcept
                           ^
                           ;
/usr/local/include/sigc++-2.0/sigc++/functors/slot_base.h:350:17: error: expected ';' at end of declaration list
  bool unblock() noexcept;
                ^
                ;
/usr/local/include/sigc++-2.0/sigc++/functors/slot_base.h:371:33: warning: rvalue references are a C++11 extension [-Wc++11-extensions]
  slot_base& operator=(slot_base&& src);
                                ^
In file included from font.cc:3:
In file included from ../../libgnomeprint/libgnomeprintmm/font.h:6:
In file included from /usr/local/include/glibmm-2.4/glibmm.h:88:
In file included from /usr/local/include/glibmm-2.4/glibmm/thread.h:49:
In file included from /usr/local/include/sigc++-2.0/sigc++/sigc++.h:104:
In file included from /usr/local/include/sigc++-2.0/sigc++/signal.h:8:
In file included from /usr/local/include/sigc++-2.0/sigc++/signal_base.h:27:
/usr/local/include/sigc++-2.0/sigc++/functors/slot.h:74:58: warning: deleted function definitions are a C++11 extension [-Wc++11-extensions]
  typed_slot_rep& operator=(const typed_slot_rep& src) = delete;
                                                         ^
/usr/local/include/sigc++-2.0/sigc++/functors/slot.h:76:32: warning: rvalue references are a C++11 extension [-Wc++11-extensions]
  typed_slot_rep(typed_slot_rep&& src) = delete;
                               ^
/usr/local/include/sigc++-2.0/sigc++/functors/slot.h:76:42: warning: deleted function definitions are a C++11 extension [-Wc++11-extensions]
  typed_slot_rep(typed_slot_rep&& src) = delete;
                                         ^
/usr/local/include/sigc++-2.0/sigc++/functors/slot.h:77:43: warning: rvalue references are a C++11 extension [-Wc++11-extensions]
  typed_slot_rep& operator=(typed_slot_rep&& src) = delete;
                                          ^
/usr/local/include/sigc++-2.0/sigc++/functors/slot.h:77:53: warning: deleted function definitions are a C++11 extension [-Wc++11-extensions]
  typed_slot_rep& operator=(typed_slot_rep&& src) = delete;
                                                    ^
/usr/local/include/sigc++-2.0/sigc++/functors/slot.h:169:97: error: a space is required between consecutive right angle brackets (use '> >')
      return (typed_rep->functor_).SIGC_WORKAROUND_OPERATOR_PARENTHESES>
                                                                                                ^~
                                                                                                > >
/usr/local/include/sigc++-2.0/sigc++/functors/slot.h:205:124: error: a space is required between consecutive right angle brackets (use '> >')
      return (typed_rep->functor_).SIGC_WORKAROUND_OPERATOR_PARENTHESES, type_trait_take_t>
                                                                                                                           ^~
                                                                                                                           > >
/usr/local/include/sigc++-2.0/sigc++/functors/slot.h:243:151: error: a space is required between consecutive right angle brackets (use '> >')
      return (typed_rep->functor_).SIGC_WORKAROUND_OPERATOR_PARENTHESES, type_trait_take_t, type_trait_take_t>
                                                                                                                                                      ^~
                                                                                                                                                      > >
fatal error: too many errors emitted, stopping now [-ferror-limit=]
In file included from enums.cc:3:
In file included from ../../libgnomeprint/libgnomeprintmm/enums.h:6:
In file included from /usr/local/include/glibmm-2.4/glibmm.h:88:
In file included from /usr/local/include/glibmm-2.4/glibmm/thread.h:49:
In file included from /usr/local/include/sigc++-2.0/sigc++/sigc++.h:104:
In file included from /usr/local/include/sigc++-2.0/sigc++/signal.h:8:
In file included from /usr/local/include/sigc++-2.0/sigc++/signal_base.h:27:
In file included from /usr/local/include/sigc++-2.0/sigc++/functors/slot.h:7:
In file included from /usr/local/include/sigc++-2.0/sigc++/adaptors/adaptor_trait.h:10:
/usr/local/include/sigc++-2.0/sigc++/adaptors/deduce_result_type.h:48:32: warning: variadic templates are a C++11 extension [-Wc++11-extensions]
template
                               ^
/usr/local/include/sigc++-2.0/sigc++/adaptors/deduce_result_type.h:53:29: warning: default template arguments for a function template are a C++11 extension [-Wc++11-extensions]
  template::type>
                            ^          ~~~~~~~~~~~~~~~~~~~~~~~~~~~~~~~~~~~~~~~~~~~~~~~~~~~~~~~
/usr/local/include/sigc++-2.0/sigc++/adaptors/deduce_result_type.h:64:16: warning: alias declarations are a C++11 extension [-Wc++11-extensions]
  using type = decltype (test ());
               ^
/usr/include/c++/v1/__config:561:21: note: expanded from macro 'decltype'
#define decltype(x) __typeof__(x)
                    ^
In file included from enums.cc:3:
In file included from ../../libgnomeprint/libgnomeprintmm/enums.h:6:
In file included from /usr/local/include/glibmm-2.4/glibmm.h:88:
In file included from /usr/local/include/glibmm-2.4/glibmm/thread.h:49:
In file included from /usr/local/include/sigc++-2.0/sigc++/sigc++.h:104:
In file included from /usr/local/include/sigc++-2.0/sigc++/signal.h:8:
In file included from /usr/local/include/sigc++-2.0/sigc++/signal_base.h:27:
In file included from /usr/local/include/sigc++-2.0/sigc++/functors/slot.h:7:
In file included from /usr/local/include/sigc++-2.0/sigc++/adaptors/adaptor_trait.h:10:
/usr/local/include/sigc++-2.0/sigc++/adaptors/deduce_result_type.h:67:38: warning: variadic templates are a C++11 extension [-Wc++11-extensions]
template
                                     ^
/usr/local/include/sigc++-2.0/sigc++/adaptors/deduce_result_type.h:68:25: warning: alias declarations are a C++11 extension [-Wc++11-extensions]
using deduce_result_t = typename deduce_result_type::type;
                        ^
In file included from enums.cc:3:
In file included from ../../libgnomeprint/libgnomeprintmm/enums.h:6:
In file included from /usr/local/include/glibmm-2.4/glibmm.h:88:
In file included from /usr/local/include/glibmm-2.4/glibmm/thread.h:49:
In file included from /usr/local/include/sigc++-2.0/sigc++/sigc++.h:104:
In file included from /usr/local/include/sigc++-2.0/sigc++/signal.h:8:
In file included from /usr/local/include/sigc++-2.0/sigc++/signal_base.h:27:
In file included from /usr/local/include/sigc++-2.0/sigc++/functors/slot.h:8:
/usr/local/include/sigc++-2.0/sigc++/functors/slot_base.h:57:35: warning: deleted function definitions are a C++11 extension [-Wc++11-extensions]
  slot_rep(const slot_rep& src) = delete;
                                  ^
/usr/local/include/sigc++-2.0/sigc++/functors/slot_base.h:58:46: warning: deleted function definitions are a C++11 extension [-Wc++11-extensions]
  slot_rep& operator=(const slot_rep& src) = delete;
                                             ^
/usr/local/include/sigc++-2.0/sigc++/functors/slot_base.h:60:20: warning: rvalue references are a C++11 extension [-Wc++11-extensions]
  slot_rep(slot_rep&& src) = delete;
                   ^
/usr/local/include/sigc++-2.0/sigc++/functors/slot_base.h:60:30: warning: deleted function definitions are a C++11 extension [-Wc++11-extensions]
  slot_rep(slot_rep&& src) = delete;
                             ^
/usr/local/include/sigc++-2.0/sigc++/functors/slot_base.h:61:31: warning: rvalue references are a C++11 extension [-Wc++11-extensions]
  slot_rep& operator=(slot_rep&& src) = delete;
                              ^
/usr/local/include/sigc++-2.0/sigc++/functors/slot_base.h:61:41: warning: deleted function definitions are a C++11 extension [-Wc++11-extensions]
  slot_rep& operator=(slot_rep&& src) = delete;
                                        ^
/usr/local/include/sigc++-2.0/sigc++/functors/slot_base.h:91:59: error: expected ';' at end of declaration list
  inline slot_rep(hook call__, hook destroy__, hook dup__) noexcept
                                                          ^
                                                          ;
/usr/local/include/sigc++-2.0/sigc++/functors/slot_base.h:150:37: error: expected ';' at end of declaration list
  inline slot_do_bind(slot_rep* rep) noexcept : rep_(rep) {}
                                    ^
                                    ;
/usr/local/include/sigc++-2.0/sigc++/functors/slot_base.h:168:39: error: expected ';' at end of declaration list
  inline slot_do_unbind(slot_rep* rep) noexcept : rep_(rep) {}
                                      ^
                                      ;
/usr/local/include/sigc++-2.0/sigc++/functors/slot_base.h:273:14: error: expected ';' at end of declaration list
  slot_base() noexcept;
             ^
             ;
/usr/local/include/sigc++-2.0/sigc++/functors/slot_base.h:278:36: error: expected ';' at end of declaration list
  explicit slot_base(rep_type* rep) noexcept;
                                   ^
                                   ;
/usr/local/include/sigc++-2.0/sigc++/functors/slot_base.h:289:22: warning: rvalue references are a C++11 extension [-Wc++11-extensions]
  slot_base(slot_base&& src);
                     ^
/usr/local/include/sigc++-2.0/sigc++/functors/slot_base.h:300:3: warning: explicit conversion functions are a C++11 extension [-Wc++11-extensions]
  explicit operator bool() const noexcept;
  ^~~~~~~~
/usr/local/include/sigc++-2.0/sigc++/functors/slot_base.h:300:33: error: expected ';' at end of declaration list
  explicit operator bool() const noexcept;
                                ^
                                ;
/usr/local/include/sigc++-2.0/sigc++/functors/slot_base.h:309:63: error: expected ';' at end of declaration list
  void set_parent(void* parent, void* (*cleanup)(void*)) const noexcept;
                                                              ^
                                                              ;
/usr/local/include/sigc++-2.0/sigc++/functors/slot_base.h:328:28: error: expected ';' at end of declaration list
  inline bool empty() const noexcept
                           ^
                           ;
/usr/local/include/sigc++-2.0/sigc++/functors/slot_base.h:350:17: error: expected ';' at end of declaration list
  bool unblock() noexcept;
                ^
                ;
/usr/local/include/sigc++-2.0/sigc++/functors/slot_base.h:371:33: warning: rvalue references are a C++11 extension [-Wc++11-extensions]
  slot_base& operator=(slot_base&& src);
                                ^
In file included from enums.cc:3:
In file included from ../../libgnomeprint/libgnomeprintmm/enums.h:6:
In file included from /usr/local/include/glibmm-2.4/glibmm.h:88:
In file included from /usr/local/include/glibmm-2.4/glibmm/thread.h:49:
In file included from /usr/local/include/sigc++-2.0/sigc++/sigc++.h:104:
In file included from /usr/local/include/sigc++-2.0/sigc++/signal.h:8:
In file included from /usr/local/include/sigc++-2.0/sigc++/signal_base.h:27:
/usr/local/include/sigc++-2.0/sigc++/functors/slot.h:74:58: warning: deleted function definitions are a C++11 extension [-Wc++11-extensions]
  typed_slot_rep& operator=(const typed_slot_rep& src) = delete;
                                                         ^
/usr/local/include/sigc++-2.0/sigc++/functors/slot.h:76:32: warning: rvalue references are a C++11 extension [-Wc++11-extensions]
  typed_slot_rep(typed_slot_rep&& src) = delete;
                               ^
/usr/local/include/sigc++-2.0/sigc++/functors/slot.h:76:42: warning: deleted function definitions are a C++11 extension [-Wc++11-extensions]
  typed_slot_rep(typed_slot_rep&& src) = delete;
                                         ^
/usr/local/include/sigc++-2.0/sigc++/functors/slot.h:77:43: warning: rvalue references are a C++11 extension [-Wc++11-extensions]
  typed_slot_rep& operator=(typed_slot_rep&& src) = delete;
                                          ^
/usr/local/include/sigc++-2.0/sigc++/functors/slot.h:77:53: warning: deleted function definitions are a C++11 extension [-Wc++11-extensions]
  typed_slot_rep& operator=(typed_slot_rep&& src) = delete;
                                                    ^
/usr/local/include/sigc++-2.0/sigc++/functors/slot.h:169:97: error: a space is required between consecutive right angle brackets (use '> >')
In file included from job.cc:3:
In file included from ../../libgnomeprint/libgnomeprintmm/job.h:6:
In file included from /usr/local/include/glibmm-2.4/glibmm.h:88:
In file included from /usr/local/include/glibmm-2.4/glibmm/thread.h:49:
In file included from /usr/local/include/sigc++-2.0/sigc++/sigc++.h:104:
In file included from /usr/local/include/sigc++-2.0/sigc++/signal.h:8:
In file included from /usr/local/include/sigc++-2.0/sigc++/signal_base.h:27:
In file included from /usr/local/include/sigc++-2.0/sigc++/functors/slot.h:7:
In file included from /usr/local/include/sigc++-2.0/sigc++/adaptors/adaptor_trait.h:10:
/usr/local/include/sigc++-2.0/sigc++/adaptors/deduce_result_type.h:48:32: warning: variadic templates are a C++11 extension [-Wc++11-extensions]
      return (typed_rep->functor_).SIGC_WORKAROUND_OPERATOR_PARENTHESES>template
                               ^
/usr/local/include/sigc++-2.0/sigc++/adaptors/deduce_result_type.h:53:29: warning: default template arguments for a function template are a C++11 extension [-Wc++11-extensions]

                                                                                                ^~
                                                                                                > >
  template::type>
                            ^          ~~~~~~~~~~~~~~~~~~~~~~~~~~~~~~~~~~~~~~~~~~~~~~~~~~~~~~~
/usr/local/include/sigc++-2.0/sigc++/adaptors/deduce_result_type.h:64:16: warning: alias declarations are a C++11 extension [-Wc++11-extensions]
/usr/local/include/sigc++-2.0/sigc++/functors/slot.h:205:124: error: a space is required between consecutive right angle brackets (use '> >')
  using type = decltype (test ());
               ^
/usr/include/c++/v1/__config:561:21: note: expanded from macro 'decltype'
      return (typed_rep->functor_).SIGC_WORKAROUND_OPERATOR_PARENTHESES, type_trait_take_t>
                                                                                                                           ^~
                                                                                                                           > >
#define decltype(x) __typeof__(x)
                    ^
In file included from job.cc:3:
In file included from ../../libgnomeprint/libgnomeprintmm/job.h:6:
In file included from /usr/local/include/glibmm-2.4/glibmm.h:88:
In file included from /usr/local/include/glibmm-2.4/glibmm/thread.h:49:
In file included from /usr/local/include/sigc++-2.0/sigc++/sigc++.h:104:
In file included from /usr/local/include/sigc++-2.0/sigc++/signal.h:8:
In file included from /usr/local/include/sigc++-2.0/sigc++/signal_base.h:27:
In file included from /usr/local/include/sigc++-2.0/sigc++/functors/slot.h:7:
In file included from /usr/local/include/sigc++-2.0/sigc++/adaptors/adaptor_trait.h:/usr/local/include/sigc++-2.0/sigc++/functors/slot.h:243:151: error: a space is required between consecutive right angle brackets (use '> >')
10:
/usr/local/include/sigc++-2.0/sigc++/adaptors/deduce_result_type.h:67:38: warning: variadic templates are a C++11 extension [-Wc++11-extensions]
      return (typed_rep->functor_).SIGC_WORKAROUND_OPERATOR_PARENTHESES, type_trait_take_t, type_trait_take_t>
                                                                                                                                                      ^~
                                                                                                                                                      > >
template
                                     ^
/usr/local/include/sigc++-2.0/sigc++/adaptors/deduce_result_type.h:68:25: warning: alias declarations are a C++11 extension [-Wc++11-extensions]
using deduce_result_t = typename deduce_result_type::type;
                        ^
fatal error: too many errors emitted, stopping now [-ferror-limit=]
In file included from job.cc:3:
In file included from ../../libgnomeprint/libgnomeprintmm/job.h:6:
In file included from /usr/local/include/glibmm-2.4/glibmm.h:88:
In file included from /usr/local/include/glibmm-2.4/glibmm/thread.h:49:
In file included from /usr/local/include/sigc++-2.0/sigc++/sigc++.h:104:
In file included from /usr/local/include/sigc++-2.0/sigc++/signal.h:8:
In file included from /usr/local/include/sigc++-2.0/sigc++/signal_base.h:27:
In file included from /usr/local/include/sigc++-2.0/sigc++/functors/slot.h:8:
/usr/local/include/sigc++-2.0/sigc++/functors/slot_base.h:57:35: warning: deleted function definitions are a C++11 extension [-Wc++11-extensions]
  slot_rep(const slot_rep& src) = delete;
                                  ^
/usr/local/include/sigc++-2.0/sigc++/functors/slot_base.h:58:46: warning: deleted function definitions are a C++11 extension [-Wc++11-extensions]
  slot_rep& operator=(const slot_rep& src) = delete;
                                             ^
/usr/local/include/sigc++-2.0/sigc++/functors/slot_base.h:60:20: warning: rvalue references are a C++11 extension [-Wc++11-extensions]
  slot_rep(slot_rep&& src) = delete;
                   ^
/usr/local/include/sigc++-2.0/sigc++/functors/slot_base.h:60:30: warning: deleted function definitions are a C++11 extension [-Wc++11-extensions]
  slot_rep(slot_rep&& src) = delete;
                             ^
/usr/local/include/sigc++-2.0/sigc++/functors/slot_base.h:61:31: warning: rvalue references are a C++11 extension [-Wc++11-extensions]
  slot_rep& operator=(slot_rep&& src) = delete;
                              ^
/usr/local/include/sigc++-2.0/sigc++/functors/slot_base.h:61:41: warning: deleted function definitions are a C++11 extension [-Wc++11-extensions]
  slot_rep& operator=(slot_rep&& src) = delete;
                                        ^
/usr/local/include/sigc++-2.0/sigc++/functors/slot_base.h:91:59: error: expected ';' at end of declaration list
  inline slot_rep(hook call__, hook destroy__, hook dup__) noexcept
                                                          ^
                                                          ;
/usr/local/include/sigc++-2.0/sigc++/functors/slot_base.h:150:37: error: expected ';' at end of declaration list
  inline slot_do_bind(slot_rep* rep) noexcept : rep_(rep) {}
                                    ^
                                    ;
/usr/local/include/sigc++-2.0/sigc++/functors/slot_base.h:168:39: error: expected ';' at end of declaration list
  inline slot_do_unbind(slot_rep* rep) noexcept : rep_(rep) {}
                                      ^
                                      ;
/usr/local/include/sigc++-2.0/sigc++/functors/slot_base.h:273:14: error: expected ';' at end of declaration list
  slot_base() noexcept;
             ^
             ;
/usr/local/include/sigc++-2.0/sigc++/functors/slot_base.h:278:36: error: expected ';' at end of declaration list
  explicit slot_base(rep_type* rep) noexcept;
                                   ^
                                   ;
/usr/local/include/sigc++-2.0/sigc++/functors/slot_base.h:289:22: warning: rvalue references are a C++11 extension [-Wc++11-extensions]
  slot_base(slot_base&& src);
                     ^
/usr/local/include/sigc++-2.0/sigc++/functors/slot_base.h:300:3: warning: explicit conversion functions are a C++11 extension [-Wc++11-extensions]
  explicit operator bool() const noexcept;
  ^~~~~~~~
/usr/local/include/sigc++-2.0/sigc++/functors/slot_base.h:300:33: error: expected ';' at end of declaration list
  explicit operator bool() const noexcept;
                                ^
                                ;
/usr/local/include/sigc++-2.0/sigc++/functors/slot_base.h:309:63: error: expected ';' at end of declaration list
  void set_parent(void* parent, void* (*cleanup)(void*)) const noexcept;
                                                              ^
                                                              ;
/usr/local/include/sigc++-2.0/sigc++/functors/slot_base.h:328:28: error: expected ';' at end of declaration list
  inline bool empty() const noexcept
                           ^
                           ;
/usr/local/include/sigc++-2.0/sigc++/functors/slot_base.h:350:17: error: expected ';' at end of declaration list
  bool unblock() noexcept;
                ^
                ;
/usr/local/include/sigc++-2.0/sigc++/functors/slot_base.h:371:33: warning: rvalue references are a C++11 extension [-Wc++11-extensions]
  slot_base& operator=(slot_base&& src);
                                ^
In file included from job.cc:3:
In file included from ../../libgnomeprint/libgnomeprintmm/job.h:6:
In file included from /usr/local/include/glibmm-2.4/glibmm.h:88:
In file included from /usr/local/include/glibmm-2.4/glibmm/thread.h:49:
In file included from /usr/local/include/sigc++-2.0/sigc++/sigc++.h:104:
In file included from /usr/local/include/sigc++-2.0/sigc++/signal.h:8:
In file included from /usr/local/include/sigc++-2.0/sigc++/signal_base.h:27:
/usr/local/include/sigc++-2.0/sigc++/functors/slot.h:74:58: warning: deleted function definitions are a C++11 extension [-Wc++11-extensions]
  typed_slot_rep& operator=(const typed_slot_rep& src) = delete;
                                                         ^
/usr/local/include/sigc++-2.0/sigc++/functors/slot.h:76:32: warning: rvalue references are a C++11 extension [-Wc++11-extensions]
  typed_slot_rep(typed_slot_rep&& src) = delete;
                               ^
/usr/local/include/sigc++-2.0/sigc++/functors/slot.h:76:42: warning: deleted function definitions are a C++11 extension [-Wc++11-extensions]
  typed_slot_rep(typed_slot_rep&& src) = delete;
                                         ^
/usr/local/include/sigc++-2.0/sigc++/functors/slot.h:77:43: warning: rvalue references are a C++11 extension [-Wc++11-extensions]
  typed_slot_rep& operator=(typed_slot_rep&& src) = delete;
                                          ^
/usr/local/include/sigc++-2.0/sigc++/functors/slot.h:77:53: warning: deleted function definitions are a C++11 extension [-Wc++11-extensions]
  typed_slot_rep& operator=(typed_slot_rep&& src) = delete;
                                                    ^
/usr/local/include/sigc++-2.0/sigc++/functors/slot.h:169:97: error: a space is required between consecutive right angle brackets (use '> >')
      return (typed_rep->functor_).SIGC_WORKAROUND_OPERATOR_PARENTHESES>
                                                                                                ^~
                                                                                                > >
/usr/local/include/sigc++-2.0/sigc++/functors/slot.h:205:124: error: a space is required between consecutive right angle brackets (use '> >')
      return (typed_rep->functor_).SIGC_WORKAROUND_OPERATOR_PARENTHESES, type_trait_take_t>
                                                                                                                           ^~
                                                                                                                           > >
In file included from wrap_init.cc:11:
In file included from /usr/local/include/glibmm-2.4/glibmm/object.h:29:
In file included from /usr/local/include/glibmm-2.4/glibmm/objectbase.h:22:
In file included from /usr/local/include/glibmm-2.4/glibmm/signalproxy.h:27:
In file included from /usr/local/include/sigc++-2.0/sigc++/sigc++.h:104:
In file included from /usr/local/include/sigc++-2.0/sigc++/signal.h:8:
In file included from /usr/local/include/sigc++-2.0/sigc++/signal_base.h:27:
In file included from /usr/local/include/sigc++-2.0/sigc++/functors/slot.h:7:
In file included from /usr/local/include/sigc++-2.0/sigc++/adaptors/adaptor_trait.h:10:
/usr/local/include/sigc++-2.0/sigc++/adaptors/deduce_result_type.h:48:32: warning: variadic templates are a C++11 extension [-Wc++11-extensions]
/usr/local/include/sigc++-2.0/sigc++/functors/slot.h:243:151: error: a space is required between consecutive right angle brackets (use '> >')
template
                               ^
      return (typed_rep->functor_).SIGC_WORKAROUND_OPERATOR_PARENTHESES, type_trait_take_t, type_trait_take_t>
                                                                                                                                                      ^~
                                                                                                                                                      > >
/usr/local/include/sigc++-2.0/sigc++/adaptors/deduce_result_type.h:53:29: warning: default template arguments for a function template are a C++11 extension [-Wc++11-extensions]
  template::type>
                            ^          ~~~~~~~~~~~~~~~~~~~~~~~~~~~~~~~~~~~~~~~~~~~~~~~~~~~~~~~
/usr/local/include/sigc++-2.0/sigc++/adaptors/deduce_result_type.h:64:16: warning: alias declarations are a C++11 extension [-Wc++11-extensions]
  using type = decltype (test ());
               ^
fatal error: too many errors emitted, stopping now [-ferror-limit=]
/usr/include/c++/v1/__config:561:21: note: expanded from macro 'decltype'
#define decltype(x) __typeof__(x)
                    ^
In file included from wrap_init.cc:11:
In file included from /usr/local/include/glibmm-2.4/glibmm/object.h:29:
In file included from /usr/local/include/glibmm-2.4/glibmm/objectbase.h:22:
In file included from /usr/local/include/glibmm-2.4/glibmm/signalproxy.h:27:
In file included from /usr/local/include/sigc++-2.0/sigc++/sigc++.h:104:
In file included from /usr/local/include/sigc++-2.0/sigc++/signal.h:8:
In file included from /usr/local/include/sigc++-2.0/sigc++/signal_base.h:27:
In file included from /usr/local/include/sigc++-2.0/sigc++/functors/slot.h:7:
In file included from /usr/local/include/sigc++-2.0/sigc++/adaptors/adaptor_trait.h:10:
/usr/local/include/sigc++-2.0/sigc++/adaptors/deduce_result_type.h:67:38: warning: variadic templates are a C++11 extension [-Wc++11-extensions]
template
                                     ^
/usr/local/include/sigc++-2.0/sigc++/adaptors/deduce_result_type.h:68:25: warning: alias declarations are a C++11 extension [-Wc++11-extensions]
using deduce_result_t = typename deduce_result_type::type;
                        ^
In file included from wrap_init.cc:11:
In file included from /usr/local/include/glibmm-2.4/glibmm/object.h:29:
In file included from /usr/local/include/glibmm-2.4/glibmm/objectbase.h:22:
In file included from /usr/local/include/glibmm-2.4/glibmm/signalproxy.h:27:
In file included from /usr/local/include/sigc++-2.0/sigc++/sigc++.h:104:
In file included from /usr/local/include/sigc++-2.0/sigc++/signal.h:8:
In file included from /usr/local/include/sigc++-2.0/sigc++/signal_base.h:27:
In file included from /usr/local/include/sigc++-2.0/sigc++/functors/slot.h:8:
/usr/local/include/sigc++-2.0/sigc++/functors/slot_base.h:57:35: warning: deleted function definitions are a C++11 extension [-Wc++11-extensions]
  slot_rep(const slot_rep& src) = delete;
                                  ^
/usr/local/include/sigc++-2.0/sigc++/functors/slot_base.h:58:46: warning: deleted function definitions are a C++11 extension [-Wc++11-extensions]
  slot_rep& operator=(const slot_rep& src) = delete;
                                             ^
/usr/local/include/sigc++-2.0/sigc++/functors/slot_base.h:60:20: warning: rvalue references are a C++11 extension [-Wc++11-extensions]
  slot_rep(slot_rep&& src) = delete;
                   ^
/usr/local/include/sigc++-2.0/sigc++/functors/slot_base.h:60:30: warning: deleted function definitions are a C++11 extension [-Wc++11-extensions]
  slot_rep(slot_rep&& src) = delete;
                             ^
/usr/local/include/sigc++-2.0/sigc++/functors/slot_base.h:61:31: warning: rvalue references are a C++11 extension [-Wc++11-extensions]
  slot_rep& operator=(slot_rep&& src) = delete;
                              ^
/usr/local/include/sigc++-2.0/sigc++/functors/slot_base.h:61:41: warning: deleted function definitions are a C++11 extension [-Wc++11-extensions]
  slot_rep& operator=(slot_rep&& src) = delete;
                                        ^
/usr/local/include/sigc++-2.0/sigc++/functors/slot_base.h:91:59: error: expected ';' at end of declaration list
  inline slot_rep(hook call__, hook destroy__, hook dup__) noexcept
                                                          ^
                                                          ;
/usr/local/include/sigc++-2.0/sigc++/functors/slot_base.h:150:37: error: expected ';' at end of declaration list
  inline slot_do_bind(slot_rep* rep) noexcept : rep_(rep) {}
                                    ^
                                    ;
/usr/local/include/sigc++-2.0/sigc++/functors/slot_base.h:168:39: error: expected ';' at end of declaration list
  inline slot_do_unbind(slot_rep* rep) noexcept : rep_(rep) {}
                                      ^
                                      ;
/usr/local/include/sigc++-2.0/sigc++/functors/slot_base.h:273:14: error: expected ';' at end of declaration list
  slot_base() noexcept;
             ^
             ;
/usr/local/include/sigc++-2.0/sigc++/functors/slot_base.h:278:36: error: expected ';' at end of declaration list
  explicit slot_base(rep_type* rep) noexcept;
                                   ^
                                   ;
/usr/local/include/sigc++-2.0/sigc++/functors/slot_base.h:289:22: warning: rvalue references are a C++11 extension [-Wc++11-extensions]
  slot_base(slot_base&& src);
                     ^
/usr/local/include/sigc++-2.0/sigc++/functors/slot_base.h:300:3: warning: explicit conversion functions are a C++11 extension [-Wc++11-extensions]
  explicit operator bool() const noexcept;
  ^~~~~~~~
/usr/local/include/sigc++-2.0/sigc++/functors/slot_base.h:300:33: error: expected ';' at end of declaration list
  explicit operator bool() const noexcept;
                                ^
                                ;
/usr/local/include/sigc++-2.0/sigc++/functors/slot_base.h:309:63: error: expected ';' at end of declaration list
  void set_parent(void* parent, void* (*cleanup)(void*)) const noexcept;
                                                              ^
                                                              ;
/usr/local/include/sigc++-2.0/sigc++/functors/slot_base.h:328:28: error: expected ';' at end of declaration list
  inline bool empty() const noexcept
                           ^
                           ;
/usr/local/include/sigc++-2.0/sigc++/functors/slot_base.h:350:17: error: expected ';' at end of declaration list
  bool unblock() noexcept;
                ^
                ;
/usr/local/include/sigc++-2.0/sigc++/functors/slot_base.h:371:33: warning: rvalue references are a C++11 extension [-Wc++11-extensions]
  slot_base& operator=(slot_base&& src);
                                ^
In file included from wrap_init.cc:11:
In file included from /usr/local/include/glibmm-2.4/glibmm/object.h:29:
In file included from /usr/local/include/glibmm-2.4/glibmm/objectbase.h:22:
In file included from /usr/local/include/glibmm-2.4/glibmm/signalproxy.h:27:
In file included from /usr/local/include/sigc++-2.0/sigc++/sigc++.h:104:
In file included from /usr/local/include/sigc++-2.0/sigc++/signal.h:8:
In file included from /usr/local/include/sigc++-2.0/sigc++/signal_base.h:27:
/usr/local/include/sigc++-2.0/sigc++/functors/slot.h:74:58: warning: deleted function definitions are a C++11 extension [-Wc++11-extensions]
  typed_slot_rep& operator=(const typed_slot_rep& src) = delete;
                                                         ^
/usr/local/include/sigc++-2.0/sigc++/functors/slot.h:76:32: warning: rvalue references are a C++11 extension [-Wc++11-extensions]
  typed_slot_rep(typed_slot_rep&& src) = delete;
                               ^
/usr/local/include/sigc++-2.0/sigc++/functors/slot.h:76:42: warning: deleted function definitions are a C++11 extension [-Wc++11-extensions]
  typed_slot_rep(typed_slot_rep&& src) = delete;
                                         ^
/usr/local/include/sigc++-2.0/sigc++/functors/slot.h:77:43: warning: rvalue references are a C++11 extension [-Wc++11-extensions]
  typed_slot_rep& operator=(typed_slot_rep&& src) = delete;
                                          ^
/usr/local/include/sigc++-2.0/sigc++/functors/slot.h:77:53: warning: deleted function definitions are a C++11 extension [-Wc++11-extensions]
  typed_slot_rep& operator=(typed_slot_rep&& src) = delete;
                                                    ^
/usr/local/include/sigc++-2.0/sigc++/functors/slot.h:169:97: error: a space is required between consecutive right angle brackets (use '> >')
      return (typed_rep->functor_).SIGC_WORKAROUND_OPERATOR_PARENTHESES>
                                                                                                ^~
                                                                                                > >
/usr/local/include/sigc++-2.0/sigc++/functors/slot.h:205:124: error: a space is required between consecutive right angle brackets (use '> >')
      return (typed_rep->functor_).SIGC_WORKAROUND_OPERATOR_PARENTHESES, type_trait_take_t>
                                                                                                                           ^~
                                                                                                                           > >
/usr/local/include/sigc++-2.0/sigc++/functors/slot.h:243:151: error: a space is required between consecutive right angle brackets (use '> >')
      return (typed_rep->functor_).SIGC_WORKAROUND_OPERATOR_PARENTHESES, type_trait_take_t, type_trait_take_t>
                                                                                                                                                      ^~
                                                                                                                                                      > >
fatal error: too many errors emitted, stopping now [-ferror-limit=]
75 warnings and 20 errors generated.
gmake[5]: *** [Makefile:339: context.lo] Error 1
gmake[5]: *** Waiting for unfinished jobs....
75 warnings and 20 errors generated.
gmake[5]: *** [Makefile:339: private.lo] Error 1
75 warnings and 20 errors generated.
gmake[5]: *** [Makefile:339: job.lo] Error 1
77 warnings and 20 errors generated.
gmake[5]: *** [Makefile:339: wrap_init.lo] Error 1
75 warnings and 20 errors generated.
75 warnings and 20 errors generated.
gmake[5]: *** [Makefile:339: enums.lo] Error 1
75 warnings and 20 errors generated.
gmake[5]: *** [Makefile:339: config.lo] Error 1
gmake[5]: *** [Makefile:339: font.lo] Error 1
gmake[5]: Leaving directory '/magus/work/usr/mports/print/libgnomeprintmm/work/libgnomeprintmm-2.5.1/libgnomeprint/libgnomeprintmm'
gmake[4]: *** [Makefile:380: all-recursive] Error 1
gmake[4]: Leaving directory '/magus/work/usr/mports/print/libgnomeprintmm/work/libgnomeprintmm-2.5.1/libgnomeprint/libgnomeprintmm'
gmake[3]: *** [Makefile:318: all-recursive] Error 1
gmake[3]: Leaving directory '/magus/work/usr/mports/print/libgnomeprintmm/work/libgnomeprintmm-2.5.1/libgnomeprint'
gmake[2]: *** [Makefile:196: all] Error 2
gmake[2]: Leaving directory '/magus/work/usr/mports/print/libgnomeprintmm/work/libgnomeprintmm-2.5.1/libgnomeprint'
gmake[1]: *** [Makefile:249: all-recursive] Error 1
gmake[1]: Leaving directory '/magus/work/usr/mports/print/libgnomeprintmm/work/libgnomeprintmm-2.5.1'
===> Compilation failed unexpectedly.
Try to set MAKE_JOBS_UNSAFE=yes and rebuild before reporting the failure to
the maintainer.
*** Error code 1

Stop.
make: stopped in /usr/mports/print/libgnomeprintmm