MidnightBSD Magus

x11-toolkits/gnome-sharp20

GNOME interfaces for the .NET runtime

Flavor Version Run OSVersion Arch License Restricted Status
2.24.4 416 1.2 amd64 lgpl2.1 0 fail

Events

Machine Type Time Message
m1264 fail 2020-08-16 14:06:33.945672 Test complete.
m1264 fail 2020-08-16 14:06:33.338453 make build returned non-zero: 1
m1264 info 2020-08-16 14:04:33.261426 Test Started

Log

===>  Building for gnome-sharp-2.24.4
gmake[1]: Entering directory '/magus/work/usr/mports/x11-toolkits/gnome-sharp20/work/gnome-sharp-2.24.4'
gmake  all-recursive
gmake[2]: Entering directory '/magus/work/usr/mports/x11-toolkits/gnome-sharp20/work/gnome-sharp-2.24.4'
Making all in sources
gmake[3]: Entering directory '/magus/work/usr/mports/x11-toolkits/gnome-sharp20/work/gnome-sharp-2.24.4/sources'
gmake[3]: Nothing to be done for 'all'.
gmake[3]: Leaving directory '/magus/work/usr/mports/x11-toolkits/gnome-sharp20/work/gnome-sharp-2.24.4/sources'
Making all in art
gmake[3]: Entering directory '/magus/work/usr/mports/x11-toolkits/gnome-sharp20/work/gnome-sharp-2.24.4/art'
cp ./art-api.raw art-api.xml
cp ../gtk-sharp.snk .
cp ../AssemblyInfo.cs .
sed -e "s/@ASSEMBLY_NAME@/art-sharp/" -e "s/@POLICY@/2.4/" ../policy.config > policy.2.4.config
sed -e "s/@ASSEMBLY_NAME@/art-sharp/" -e "s/@POLICY@/2.6/" ../policy.config > policy.2.6.config
chmod u+w art-api.xml
sed -e "s/@ASSEMBLY_NAME@/art-sharp/" -e "s/@POLICY@/2.8/" ../policy.config > policy.2.8.config
sed -e "s/@ASSEMBLY_NAME@/art-sharp/" -e "s/@POLICY@/2.16/" ../policy.config > policy.2.16.config
sed -e "s/@ASSEMBLY_NAME@/art-sharp/" -e "s/@POLICY@/2.20/" ../policy.config > policy.2.20.config
/usr/local/bin/gapi2-fixup --api=art-api.xml --metadata=./Art.metadata  --symbols=./art-symbols.xml
/usr/local/bin/al -link:policy.2.4.config -out:policy.2.4.art-sharp.dll -keyfile:gtk-sharp.snk
/usr/local/bin/al -link:policy.2.6.config -out:policy.2.6.art-sharp.dll -keyfile:gtk-sharp.snk
/usr/local/bin/al -link:policy.2.8.config -out:policy.2.8.art-sharp.dll -keyfile:gtk-sharp.snk
/usr/local/bin/al -link:policy.2.16.config -out:policy.2.16.art-sharp.dll -keyfile:gtk-sharp.snk
/usr/local/bin/al -link:policy.2.20.config -out:policy.2.20.art-sharp.dll -keyfile:gtk-sharp.snk
ALINK: warning A99999: Path 'policy.2.6.config' in the resource name is not supported. Using just file name 'policy.2.6.config'
ALINK: warning A99999: Path 'policy.2.4.config' in the resource name is not supported. Using just file name 'policy.2.4.config'
ALINK: warning A99999: Path 'policy.2.16.config' in the resource name is not supported. Using just file name 'policy.2.16.config'
ALINK: warning A99999: Path 'policy.2.20.config' in the resource name is not supported. Using just file name 'policy.2.20.config'
ALINK: warning A99999: Path 'policy.2.8.config' in the resource name is not supported. Using just file name 'policy.2.8.config'
rm -f generated/* &&	\
/usr/local/bin/gapi2-codegen --generate art-api.xml \
-I:/usr/local/libdata/pkgconfig/../../share/gapi-2.0/pango-api.xml -I:/usr/local/libdata/pkgconfig/../../share/gapi-2.0/atk-api.xml -I:/usr/local/libdata/pkgconfig/../../share/gapi-2.0/gdk-api.xml -I:/usr/local/libdata/pkgconfig/../../share/gapi-2.0/gtk-api.xml -I:/usr/local/libdata/pkgconfig/../../share/gapi-2.0/glib-api.xml  	\
--outdir=generated --customdir=. --assembly-name=art-sharp	\
--gluelib-name=artsharpglue-2 --glue-filename=glue/generated.c		\
--glue-includes=						\
&& touch generated-stamp
Simple type element art_u8 has no specified default value
Simple type element art_u32 has no specified default value
Unable to create specified glue file.  Glue will not be generated.
Defaulting DestroyNotify param to 'call' scope in method PixBuf.art_pixbuf_new_rgb_dnotify
Defaulting DestroyNotify param to 'call' scope in method PixBuf.art_pixbuf_new_rgba_dnotify
Defaulting RenderAaCallback param to 'call' scope in method SVP.RenderAa

Generation Summary:
  Enums: 10  Structs: 20  Boxed: 0  Opaques: 2  Interfaces: 0  Objects: 0  Callbacks: 2
  Properties: 0  Signals: 0  Methods: 92  Constructors: 11  Throttled: 0
Total Nodes: 137

/usr/local/bin/mcs -define:GTK_SHARP_2_6 -define:GTK_SHARP_2_8 -define:GNOME_SHARP_2_16 -define:GNOME_SHARP_2_20 -define:GNOME_SHARP_2_24 -nowarn:0169,0612,0618 -unsafe -out:art-sharp.dll -target:library -r:/usr/local/libdata/pkgconfig/../../lib/mono/gtk-sharp-2.0/pango-sharp.dll -r:/usr/local/libdata/pkgconfig/../../lib/mono/gtk-sharp-2.0/atk-sharp.dll -r:/usr/local/libdata/pkgconfig/../../lib/mono/gtk-sharp-2.0/gdk-sharp.dll -r:/usr/local/libdata/pkgconfig/../../lib/mono/gtk-sharp-2.0/gtk-sharp.dll -r:/usr/local/libdata/pkgconfig/../../lib/mono/gtk-sharp-2.0/glib-sharp.dll   -r:Mono.Cairo  generated/*.cs  AssemblyInfo.cs
AssemblyInfo.cs(6,11): warning CS1699: Use compiler option `keyfile' or appropriate project settings instead of `AssemblyKeyFile' attribute
Compilation succeeded - 1 warning(s)
gmake[3]: Leaving directory '/magus/work/usr/mports/x11-toolkits/gnome-sharp20/work/gnome-sharp-2.24.4/art'
Making all in gnomevfs
gmake[3]: Entering directory '/magus/work/usr/mports/x11-toolkits/gnome-sharp20/work/gnome-sharp-2.24.4/gnomevfs'
Making all in .
gmake[4]: Entering directory '/magus/work/usr/mports/x11-toolkits/gnome-sharp20/work/gnome-sharp-2.24.4/gnomevfs'
cp ./gnome-vfs-api.raw gnome-vfs-api.xml
cp ../gtk-sharp.snk .
cp ../AssemblyInfo.cs .
sed -e "s/@ASSEMBLY_NAME@/gnome-vfs-sharp/" -e "s/@POLICY@/2.4/" ../policy.config > policy.2.4.config
sed -e "s/@ASSEMBLY_NAME@/gnome-vfs-sharp/" -e "s/@POLICY@/2.6/" ../policy.config > policy.2.6.config
sed -e "s/@ASSEMBLY_NAME@/gnome-vfs-sharp/" -e "s/@POLICY@/2.8/" ../policy.config > policy.2.8.config
sed -e "s/@ASSEMBLY_NAME@/gnome-vfs-sharp/" -e "s/@POLICY@/2.16/" ../policy.config > policy.2.16.config
sed -e "s/@ASSEMBLY_NAME@/gnome-vfs-sharp/" -e "s/@POLICY@/2.20/" ../policy.config > policy.2.20.config
/usr/local/bin/al -link:policy.2.4.config -out:policy.2.4.gnome-vfs-sharp.dll -keyfile:gtk-sharp.snk
/usr/local/bin/al -link:policy.2.6.config -out:policy.2.6.gnome-vfs-sharp.dll -keyfile:gtk-sharp.snk
/usr/local/bin/al -link:policy.2.8.config -out:policy.2.8.gnome-vfs-sharp.dll -keyfile:gtk-sharp.snk
chmod u+w gnome-vfs-api.xml
/usr/local/bin/al -link:policy.2.16.config -out:policy.2.16.gnome-vfs-sharp.dll -keyfile:gtk-sharp.snk
/usr/local/bin/al -link:policy.2.20.config -out:policy.2.20.gnome-vfs-sharp.dll -keyfile:gtk-sharp.snk
/usr/local/bin/gapi2-fixup --api=gnome-vfs-api.xml --metadata=./Gnomevfs.metadata  --symbols=./gnomevfs-symbols.xml
ALINK: warning A99999: Path 'policy.2.4.config' in the resource name is not supported. Using just file name 'policy.2.4.config'
ALINK: warning A99999: Path 'policy.2.8.config' in the resource name is not supported. Using just file name 'policy.2.8.config'
ALINK: warning A99999: Path 'policy.2.16.config' in the resource name is not supported. Using just file name 'policy.2.16.config'
ALINK: warning A99999: Path 'policy.2.20.config' in the resource name is not supported. Using just file name 'policy.2.20.config'
ALINK: warning A99999: Path 'policy.2.6.config' in the resource name is not supported. Using just file name 'policy.2.6.config'
Warning:  matched no nodes
Warning:  matched no nodes
Warning:  matched no nodes
Warning:  matched no nodes
Warning:  matched no nodes
Warning:  matched no nodes
Warning:  matched no nodes
Warning:  matched no nodes
Warning:  matched no nodes
Warning:  matched no nodes
Warning:  matched no nodes
Warning:  matched no nodes
Warning:  matched no nodes
rm -f generated/* &&	\
/usr/local/bin/gapi2-codegen --generate gnome-vfs-api.xml \
-I:/usr/local/libdata/pkgconfig/../../share/gapi-2.0/pango-api.xml -I:/usr/local/libdata/pkgconfig/../../share/gapi-2.0/atk-api.xml -I:/usr/local/libdata/pkgconfig/../../share/gapi-2.0/gdk-api.xml -I:/usr/local/libdata/pkgconfig/../../share/gapi-2.0/gtk-api.xml -I:/usr/local/libdata/pkgconfig/../../share/gapi-2.0/glib-api.xml  	\
--outdir=generated --customdir=. --assembly-name=gnome-vfs-sharp	\
--gluelib-name=gnome-vfssharpglue-2 --glue-filename=glue/generated.c		\
--glue-includes=						\
&& touch generated-stamp
Name: cancellation Type: GnomeVFSCancellation*  in callback GnomeVFSSocketSetTimeoutFunc
Name: ace Type: GnomeVFSACE* in gnome_vfs_acl_unset  in method Unset in type Gnome.Vfs.ACL
Name: ace Type: GnomeVFSACE* in gnome_vfs_acl_set  in method Set in type Gnome.Vfs.ACL
Name: sa Type: sockaddr* in gnome_vfs_address_new_from_sockaddr in type Gnome.Vfs.Address
rettype: GnomeVFSCancellation* in method GetCancellation in type Gnome.Vfs.Context
Name: kind Type: GnomeVFSFindDirectoryKind in gnome_vfs_find_directory_cancellable  in method FindDirectoryCancellable in type Gnome.Vfs.Global
Name: optional_stat_info Type: stat* in gnome_vfs_get_file_mime_type  in method GetFileMimeType in type Gnome.Vfs.Global
Name: buffer Type: GnomeVFSMimeSniffBuffer* in gnome_vfs_get_mime_type_for_buffer  in method GetMimeTypeForBuffer in type Gnome.Vfs.Global
Name: optional_stat_info Type: stat* in gnome_vfs_get_file_mime_type_fast  in method GetFileMimeTypeFast in type Gnome.Vfs.Global
Name: kind Type: GnomeVFSFindDirectoryKind in gnome_vfs_find_directory  in method FindDirectory in type Gnome.Vfs.Global
Name: statptr Type: stat* in gnome_vfs_stat_to_file_info  in method StatToFileInfo in type Gnome.Vfs.Global
Name: child Type: pid_t* in gnome_vfs_pty_open  in method PtyOpen in type Gnome.Vfs.Global
Name: s Type: stat* in gnome_vfs_parse_ls_lga  in method ParseLsLga in type Gnome.Vfs.Global
Name: message Type: DBusMessage* in gnome_vfs_daemon_message_append_file_info  in method MessageAppendFileInfo in type Gnome.Vfs.Daemon
Name: iter Type: DBusMessageIter* in gnome_vfs_daemon_message_iter_append_file_info  in method MessageIterAppendFileInfo in type Gnome.Vfs.Daemon
Name: conn Type: DBusConnection* in gnome_vfs_daemon_set_current_connection  in method SetCurrentConnection in type Gnome.Vfs.Daemon
Name: iter Type: DBusMessageIter* in gnome_vfs_daemon_message_iter_get_file_info  in method MessageIterGetFileInfo in type Gnome.Vfs.Daemon
Name: dirs Type: GnomeVFSMakeURIDirs in gnome_vfs_make_uri_from_input_with_dirs  in method UriFromInputWithDirs in type Gnome.Vfs.Make
Name: mode Type: mode_t in gnome_vfs_mime_type_from_mode  in method TypeFromMode in type Gnome.Vfs.Mime
Name: mode Type: mode_t in gnome_vfs_mime_type_from_mode_or_default  in method TypeFromModeOrDefault in type Gnome.Vfs.Mime
Name: cb Type: GnomeVFSModuleCallback in gnome_vfs_module_callback_set_default  in method CallbackSetDefault in type Gnome.Vfs.Module
Name: cb Type: GnomeVFSModuleCallback in gnome_vfs_module_callback_push  in method CallbackPush in type Gnome.Vfs.Module
Unable to create specified glue file.  Glue will not be generated.
Defaulting VolumeOpCallback param to 'call' scope in method Drive.Mount
Defaulting VolumeOpCallback param to 'call' scope in method Drive.Eject
Defaulting VolumeOpCallback param to 'call' scope in method Drive.Unmount
Defaulting VolumeOpCallback param to 'call' scope in method Volume.Unmount
Defaulting VolumeOpCallback param to 'call' scope in method Volume.Eject

Generation Summary:
  Enums: 28  Structs: 5  Boxed: 0  Opaques: 12  Interfaces: 0  Objects: 5  Callbacks: 11
  Properties: 0  Signals: 9  Methods: 276  Constructors: 7  Throttled: 21
Total Nodes: 374

/usr/local/bin/mcs -define:GTK_SHARP_2_6 -define:GTK_SHARP_2_8 -define:GNOME_SHARP_2_16 -define:GNOME_SHARP_2_20 -define:GNOME_SHARP_2_24 -nowarn:0169,0612,0618 -unsafe -out:gnome-vfs-sharp.dll -target:library -r:/usr/local/libdata/pkgconfig/../../lib/mono/gtk-sharp-2.0/pango-sharp.dll -r:/usr/local/libdata/pkgconfig/../../lib/mono/gtk-sharp-2.0/atk-sharp.dll -r:/usr/local/libdata/pkgconfig/../../lib/mono/gtk-sharp-2.0/gdk-sharp.dll -r:/usr/local/libdata/pkgconfig/../../lib/mono/gtk-sharp-2.0/gtk-sharp.dll -r:/usr/local/libdata/pkgconfig/../../lib/mono/gtk-sharp-2.0/glib-sharp.dll   -r:Mono.Cairo  generated/*.cs  ./Async.cs  ./AsyncCallback.cs  ./AsyncCallbackNative.cs  ./AsyncDirectoryLoadCallback.cs  ./AsyncDirectoryLoadCallbackNative.cs  ./AsyncReadCallback.cs  ./AsyncReadCallbackNative.cs  ./AsyncWriteCallback.cs  ./AsyncWriteCallbackNative.cs  ./Directory.cs  ./FileInfo.cs  ./MimeType.cs  ./ModuleCallback.cs  ./ModuleCallbackAuthentication.cs  ./ModuleCallbackFillAuthentication.cs  ./ModuleCallbackFullAuthentication.cs  ./ModuleCallbackSaveAuthentication.cs  ./ModuleCallbackStatusMessage.cs  ./Monitor.cs  ./Sync.cs  ./Vfs.cs  ./VfsException.cs  ./VfsStream.cs  ./VfsStreamAsyncResult.cs  ./Xfer.cs  ./XferProgressCallback.cs  ./XferProgressCallbackNative.cs AssemblyInfo.cs
AssemblyInfo.cs(6,11): warning CS1699: Use compiler option `keyfile' or appropriate project settings instead of `AssemblyKeyFile' attribute
./VfsStream.cs(33,18): warning CS0649: Field `Gnome.Vfs.VfsStreamAsync.state' is never assigned to, and will always have its default value `null'
./VfsStream.cs(118,20): warning CS0414: The private field `Gnome.Vfs.VfsStream.mode' is assigned but its value is never used
Compilation succeeded - 3 warning(s)
gmake[4]: Leaving directory '/magus/work/usr/mports/x11-toolkits/gnome-sharp20/work/gnome-sharp-2.24.4/gnomevfs'
gmake[3]: Leaving directory '/magus/work/usr/mports/x11-toolkits/gnome-sharp20/work/gnome-sharp-2.24.4/gnomevfs'
Making all in gnome
gmake[3]: Entering directory '/magus/work/usr/mports/x11-toolkits/gnome-sharp20/work/gnome-sharp-2.24.4/gnome'
Making all in .
gmake[4]: Entering directory '/magus/work/usr/mports/x11-toolkits/gnome-sharp20/work/gnome-sharp-2.24.4/gnome'
cp ./gnome-api.raw gnome-api.xml
cp ../gtk-sharp.snk .
cp ../AssemblyInfo.cs .
chmod u+w gnome-api.xml
/usr/local/bin/gapi2-fixup --api=gnome-api.xml --metadata=./Gnome.metadata 
rm -f generated/* &&	\
/usr/local/bin/gapi2-codegen --generate gnome-api.xml \
-I:/usr/local/libdata/pkgconfig/../../share/gapi-2.0/pango-api.xml -I:/usr/local/libdata/pkgconfig/../../share/gapi-2.0/atk-api.xml -I:/usr/local/libdata/pkgconfig/../../share/gapi-2.0/gdk-api.xml -I:/usr/local/libdata/pkgconfig/../../share/gapi-2.0/gtk-api.xml -I:/usr/local/libdata/pkgconfig/../../share/gapi-2.0/glib-api.xml   -I:../art/art-api.xml  -I:../gnomevfs/gnome-vfs-api.xml	\
--outdir=generated --customdir=. --assembly-name=gnome-sharp	\
--gluelib-name=gnomesharpglue-2 --glue-filename=glue/generated.c		\
--glue-includes=gnome.h						\
&& touch generated-stamp
Simple type element art_u8 has no specified default value
Simple type element art_u32 has no specified default value
rettype: GOptionGroup*rettype: GOptionGroup* in callback GnomeModuleGetGOptionGroupFunc
rettype: poptContext in method Preinit in type Gnome.Program
Ellipsis parameter in gnome_program_init  in method Init in type Gnome.Program
Name: parms Type: GParameter* in gnome_program_init_paramv  in method InitParamv in type Gnome.Program
Name: pclass Type: GnomeProgramClass* in gnome_program_install_property  in method InstallProperty in type Gnome.Program
Name: Pass Type: /* in gnome_score_log  in method Log in type Gnome.Score
Ellipsis parameter in gnome_triggers_add_trigger  in method AddTrigger in type Gnome.Triggers
Ellipsis parameter in gnome_triggers_do  in method Do in type Gnome.Triggers
Ellipsis parameter in gnome_canvas_item_set  in method Set in type Gnome.CanvasItem
Nameless signal in type Gnome.CanvasRichText
Property has unknown Type value_array in type Gnome.About
Property has unknown Type value_array in type Gnome.About
Name: behavior Type: BonoboDockItemBehavior in gnome_app_add_docked  in method AddDocked in type Gnome.App
Name: item Type: BonoboDockItem* in gnome_app_add_dock_item  in method AddDockItem in type Gnome.App
Name: behavior Type: BonoboDockItemBehavior in gnome_app_add_toolbar  in method AddToolbar in type Gnome.App
rettype: BonoboDockItem* in method GetDockItemByName in type Gnome.App
Name: dock_item Type: BonoboDockItem* in gnome_app_setup_toolbar  in method SetupToolbar in type Gnome.App
rettype: BonoboDock* in method GetDock in type Gnome.App
Ellipsis parameter in gnome_client_add_static_arg  in method AddStaticArg in type Gnome.Client
Name: pid Type: pid_t in gnome_client_set_process_id  in method SetProcessId in type Gnome.Client
rettype: GtkVisibility in method IconIsVisible in type Gnome.IconList
Name: Name Type: /* in gnome_scores_display  in method Display in type Gnome.Scores
Name: options Type: poptOption* in gnome_init_with_popt_table  in method InitWithPoptTable in type Gnome.Global
Defaulting CallbackMarshal param to 'call' scope in method App.CreateToolbarInterp
Defaulting DestroyNotify param to 'call' scope in method App.CreateToolbarInterp
Defaulting CallbackMarshal param to 'call' scope in method App.CreateMenusInterp
Defaulting DestroyNotify param to 'call' scope in method App.CreateMenusInterp
Defaulting CallbackMarshal param to 'call' scope in method App.InsertMenusInterp
Defaulting DestroyNotify param to 'call' scope in method App.InsertMenusInterp
Defaulting CallbackMarshal param to 'call' scope in method Client.RequestInteractionInterp
Defaulting DestroyNotify param to 'call' scope in method Client.RequestInteractionInterp
Defaulting InteractFunction param to 'call' scope in method Client.RequestInteraction
Defaulting ThemeFileLineFunc param to 'call' scope in method ThemeFile.ForeachKey
Defaulting ThemeFileSectionFunc param to 'call' scope in method ThemeFile.ForeachSection
Defaulting GdkPixbufLoadCallback param to 'call' scope in method GdkHelper.PixbufNewFromUriAsync
Defaulting GdkPixbufDoneCallback param to 'call' scope in method GdkHelper.PixbufNewFromUriAsync
Defaulting MenuPositionFunc param to 'call' scope in method Popup.MenuDoPopup
Defaulting MenuPositionFunc param to 'call' scope in method Popup.MenuDoPopupModal

Generation Summary:
  Enums: 23  Structs: 7  Boxed: 0  Opaques: 9  Interfaces: 0  Objects: 39  Callbacks: 10
  Properties: 210  Signals: 46  Methods: 447  Constructors: 27  Throttled: 19
Total Nodes: 837

/usr/local/bin/mcs -define:GTK_SHARP_2_6 -define:GTK_SHARP_2_8 -define:GNOME_SHARP_2_16 -define:GNOME_SHARP_2_20 -define:GNOME_SHARP_2_24 -nowarn:0169,0612,0618 -unsafe -out:gnome-sharp.dll -target:library -r:/usr/local/libdata/pkgconfig/../../lib/mono/gtk-sharp-2.0/pango-sharp.dll -r:/usr/local/libdata/pkgconfig/../../lib/mono/gtk-sharp-2.0/atk-sharp.dll -r:/usr/local/libdata/pkgconfig/../../lib/mono/gtk-sharp-2.0/gdk-sharp.dll -r:/usr/local/libdata/pkgconfig/../../lib/mono/gtk-sharp-2.0/gtk-sharp.dll -r:/usr/local/libdata/pkgconfig/../../lib/mono/gtk-sharp-2.0/glib-sharp.dll   /r:../art/art-sharp.dll  /r:../gnomevfs/gnome-vfs-sharp.dll -r:Mono.Cairo  generated/*.cs  ./BonoboUIVerb.cs  ./IconTheme.cs  ./Modules.cs AssemblyInfo.cs
AssemblyInfo.cs(6,11): warning CS1699: Use compiler option `keyfile' or appropriate project settings instead of `AssemblyKeyFile' attribute
generated/App.cs(125,17): warning CS0108: `Gnome.App.Name' hides inherited member `Gtk.Widget.Name'. Use the new keyword if hiding was intended
/usr/local/libdata/pkgconfig/../../lib/mono/gtk-sharp-2.0/gtk-sharp.dll (Location of the symbol related to previous warning)
generated/ThemeFile.cs(59,26): warning CS0809: Obsolete member `Gnome.ThemeFile.ToString()' overrides non-obsolete member `object.ToString()'
/usr/local/lib/mono/4.5/mscorlib.dll (Location of the symbol related to previous warning)
generated/CanvasPathDef.custom(24,67): error CS1502: The best overloaded method match for `Gnome.CanvasPathDef.gnome_canvas_path_def_new_from_bpath(System.IntPtr)' has some invalid arguments
generated/CanvasPathDef.cs(262,24): (Location of the symbol related to previous error)
generated/CanvasPathDef.custom(24,109): error CS1615: Argument `#1' does not require `ref' modifier. Consider removing `ref' modifier
Compilation failed: 2 error(s), 3 warnings
gmake[4]: *** [Makefile:846: gnome-sharp.dll] Error 1
gmake[4]: Leaving directory '/magus/work/usr/mports/x11-toolkits/gnome-sharp20/work/gnome-sharp-2.24.4/gnome'
gmake[3]: *** [Makefile:537: all-recursive] Error 1
gmake[3]: Leaving directory '/magus/work/usr/mports/x11-toolkits/gnome-sharp20/work/gnome-sharp-2.24.4/gnome'
gmake[2]: *** [Makefile:450: all-recursive] Error 1
gmake[2]: Leaving directory '/magus/work/usr/mports/x11-toolkits/gnome-sharp20/work/gnome-sharp-2.24.4'
gmake[1]: *** [Makefile:378: all] Error 2
gmake[1]: Leaving directory '/magus/work/usr/mports/x11-toolkits/gnome-sharp20/work/gnome-sharp-2.24.4'
===> Compilation failed unexpectedly.
Try to set MAKE_JOBS_UNSAFE=yes and rebuild before reporting the failure to
the maintainer.
*** Error code 1

Stop.
make: stopped in /usr/mports/x11-toolkits/gnome-sharp20