MidnightBSD Magus


Window Maker dockapp that display game scores from excite

Flavor Version Run OSVersion Arch License Restricted Status
0.30_3 500 3.0 amd64 gpl2 0 fail


Machine Type Time Message
m3064b info 2022-11-05 21:00:48.608314 Test Started
m3064b fail 2022-11-05 21:01:08.786502 make build returned non-zero: 1
m3064b fail 2022-11-05 21:01:08.835968 Test complete.


===>  Building for wmScoreBoard-0.30_3
gmake[1]: Entering directory '/magus/work/usr/mports/misc/wmScoreBoard/work/wmScoreBoard-0.30/src'
cc -O2 -pipe -fstack-protector-strong -fno-strict-aliasing -g -Wall -c wmscoreboard.c -o wmscoreboard.o -I/usr/local/include/X11 -I/usr/local/include
cc -O2 -pipe -fstack-protector-strong -fno-strict-aliasing -g -Wall -c xutils.c -o xutils.o -I/usr/local/include/X11 -I/usr/local/include
cc -O2 -pipe -fstack-protector-strong -fno-strict-aliasing -g -Wall  -o wmScoreBoard wmscoreboard.o xutils.o -I/usr/local/include/X11 -I/usr/local/include -L/usr/local/lib -lXpm -lX11 -lXext
ld: error: duplicate symbol: iconwin
>>> defined at xutils.h:20 (./xutils.h:20)
>>>            wmscoreboard.o:(iconwin)
>>> defined at xutils.h:20 (./xutils.h:20)
>>>            xutils.o:(.bss+0x0)

ld: error: duplicate symbol: display
>>> defined at xutils.h:18 (./xutils.h:18)
>>>            wmscoreboard.o:(display)
>>> defined at xutils.h:18 (./xutils.h:18)
>>>            xutils.o:(.bss+0x8)

ld: error: duplicate symbol: win
>>> defined at xutils.h:20 (./xutils.h:20)
>>>            wmscoreboard.o:(win)
>>> defined at xutils.h:20 (./xutils.h:20)
>>>            xutils.o:(.bss+0x108)

ld: error: duplicate symbol: screen
>>> defined at xutils.h:21 (./xutils.h:21)
>>>            wmscoreboard.o:(screen)
>>> defined at xutils.h:21 (./xutils.h:21)
>>>            xutils.o:(.bss+0x110)

ld: error: duplicate symbol: Root
>>> defined at xutils.h:19 (./xutils.h:19)
>>>            wmscoreboard.o:(Root)
>>> defined at xutils.h:19 (./xutils.h:19)
>>>            xutils.o:(.bss+0x118)

ld: error: duplicate symbol: DisplayDepth
>>> defined at xutils.h:22 (./xutils.h:22)
>>>            wmscoreboard.o:(DisplayDepth)
>>> defined at xutils.h:22 (./xutils.h:22)
>>>            xutils.o:(.bss+0x120)
cc: error: linker command failed with exit code 1 (use -v to see invocation)
gmake[1]: *** [Makefile:25: wmScoreBoard] Error 1
gmake[1]: Leaving directory '/magus/work/usr/mports/misc/wmScoreBoard/work/wmScoreBoard-0.30/src'
===> Compilation failed unexpectedly.
Try to set MAKE_JOBS_UNSAFE=yes and rebuild before reporting the failure to
the maintainer.
*** Error code 1

make: stopped in /usr/mports/misc/wmScoreBoard


Depends On

Depend Of