MidnightBSD Magus

databases/mysql-connector-java

MySQL Connector/J: JDBC interface for MySQL

Version Run OSVersion Arch License Status
5.1.7 150 0.2.1 amd64 gpl2 fail

Events

Machine Type Time Message
ds9 info 2009-06-06 05:04:15 Test Started
ds9 fail 2009-06-06 05:07:04 make build returned non-zero: 1
ds9 fail 2009-06-06 05:07:04 Test complete.

Log

===>  Building for mysql-connector-java-5.1.7
Buildfile: build.xml
     [echo] Compiling class files to ./build/mysql-connector-java-5.1.7...

clean:

-compiler-check:

clean:

-init-copy:
    [mkdir] Created dir: /magus/work/usr/mports/databases/mysql-connector-java/work/mysql-connector-java-5.1.7/build
     [exec] Execute failed: java.io.IOException: java.io.IOException: svn: not found
     [copy] Copying 237 files to /magus/work/usr/mports/databases/mysql-connector-java/work/mysql-connector-java-5.1.7/build/mysql-connector-java-5.1.7
     [copy] Copied 31 empty directories to 1 empty directory under /magus/work/usr/mports/databases/mysql-connector-java/work/mysql-connector-java-5.1.7/build/mysql-connector-java-5.1.7
     [copy] Copying 10 files to /magus/work/usr/mports/databases/mysql-connector-java/work/mysql-connector-java-5.1.7/build/mysql-connector-java-5.1.7

-init-no-crypto:

init:
    [mkdir] Created dir: /magus/work/usr/mports/databases/mysql-connector-java/work/mysql-connector-java-5.1.7/build/mysql-connector-java-5.1.7/lib-nodist

-clean-output:

compile-driver-jdbc3:
    [javac] Compiling 133 source files to /magus/work/usr/mports/databases/mysql-connector-java/work/mysql-connector-java-5.1.7/build/mysql-connector-java-5.1.7
    [javac] Note: Some input files use or override a deprecated API.
    [javac] Note: Recompile with -deprecation for details.

compile-driver-jdbc4:
    [javac] Compiling 32 source files to /magus/work/usr/mports/databases/mysql-connector-java/work/mysql-connector-java-5.1.7/build/mysql-connector-java-5.1.7

BUILD FAILED
/magus/work/usr/mports/databases/mysql-connector-java/work/mysql-connector-java-5.1.7/build.xml:738: Error running /System/Library/Frameworks/JavaVM.framework/Versions/1.6/Home/bin/javac compiler

Total time: 7 seconds
*** Error code 1

Stop in /usr/mports/databases/mysql-connector-java.