MidnightBSD Magus

net/ldapdiff

Utility for patching LDAP directories using LDIF files

Flavor Version Run OSVersion Arch License Restricted Status
1.4.1 310 0.7 i386 gpl2 0 fail

Events

Machine Type Time Message
defianti386 info 2015-09-07 23:14:11.24548 Test Started
defianti386 fail 2015-09-07 23:14:23.285217 make build returned non-zero: 1
defianti386 fail 2015-09-07 23:14:23.470937 Test complete.

Log

===>  Building for ldapdiff-1.4.1
/usr/bin/make  all-am
cc -DHAVE_CONFIG_H -I.  -DDATADIR=\"/usr/local/share\"  -I/usr/local/include -I/usr/local/include  -O2 -pipe -fno-strict-aliasing -MT ldapcmp.o -MD -MP -MF .deps/ldapcmp.Tpo -c -o ldapcmp.o ldapcmp.c
cc -DHAVE_CONFIG_H -I.  -DDATADIR=\"/usr/local/share\"  -I/usr/local/include -I/usr/local/include  -O2 -pipe -fno-strict-aliasing -MT ldapconf.o -MD -MP -MF .deps/ldapconf.Tpo -c -o ldapconf.o ldapconf.c
cc -DHAVE_CONFIG_H -I.  -DDATADIR=\"/usr/local/share\"  -I/usr/local/include -I/usr/local/include  -O2 -pipe -fno-strict-aliasing -MT ldapmisc.o -MD -MP -MF .deps/ldapmisc.Tpo -c -o ldapmisc.o ldapmisc.c
cc -DHAVE_CONFIG_H -I.  -DDATADIR=\"/usr/local/share\"  -I/usr/local/include -I/usr/local/include  -O2 -pipe -fno-strict-aliasing -MT ldapmod.o -MD -MP -MF .deps/ldapmod.Tpo -c -o ldapmod.o ldapmod.c
cc -DHAVE_CONFIG_H -I.  -DDATADIR=\"/usr/local/share\"  -I/usr/local/include -I/usr/local/include  -O2 -pipe -fno-strict-aliasing -MT ldapread.o -MD -MP -MF .deps/ldapread.Tpo -c -o ldapread.o ldapread.c
cc -DHAVE_CONFIG_H -I.  -DDATADIR=\"/usr/local/share\"  -I/usr/local/include -I/usr/local/include  -O2 -pipe -fno-strict-aliasing -MT ldapwrite.o -MD -MP -MF .deps/ldapwrite.Tpo -c -o ldapwrite.o ldapwrite.c
cc -DHAVE_CONFIG_H -I.  -DDATADIR=\"/usr/local/share\"  -I/usr/local/include -I/usr/local/include  -O2 -pipe -fno-strict-aliasing -MT ldapiter.o -MD -MP -MF .deps/ldapiter.Tpo -c -o ldapiter.o ldapiter.c
cc -DHAVE_CONFIG_H -I.  -DDATADIR=\"/usr/local/share\"  -I/usr/local/include -I/usr/local/include  -O2 -pipe -fno-strict-aliasing -MT ldapstats.o -MD -MP -MF .deps/ldapstats.Tpo -c -o ldapstats.o ldapstats.c
ldapmisc.c:19:18: error: lber.h: No such file or directory
ldapcmp.c:19:18: error: lber.h: No such file or directory
ldapcmp.c:20:18: error: ldap.h: No such file or directory
ldapmisc.c:20:18: error: ldap.h: No such file or directory
ldapmod.c:19:18: error: lber.h: No such file or directory
ldapmod.c:20:18: error: ldap.h: No such file or directory
ldapconf.c:19:18: error: lber.h: No such file or directory
ldapconf.c:20:18: error: ldap.h: No such file or directory
ldapwrite.c:19:18: error: lber.h: No such file or directory
ldapwrite.c:20:18: error: ldap.h: No such file or directory
ldapiter.c:19:18: error: lber.h: No such file or directory
ldapiter.c:20:18: error: ldap.h: No such file or directory
ldapread.c:19:18: error: lber.h: No such file or directory
ldapread.c:20:18: error: ldap.h: No such file or directory
ldapstats.c:19:18: error: lber.h: No such file or directory
ldapstats.c:20:18: error: ldap.h: No such file or directory
In file included from ldapcmp.c:26:
In file included from ldapmod.c:26:
ldapdiff.h:172: error: expected ')' before '*' token
ldapdiff.h:173: error: expected ')' before '*' token
ldapdiff.h:176: error: expected ')' before '*' token
ldapdiff.h:179: error: expected ')' before '*' token
ldapdiff.h:213: error: expected ')' before '*' token
ldapdiff.h:227: error: expected ')' before '*' token
ldapdiff.h:234: error: expected ')' before '*' token
ldapdiff.h:235: error: expected ')' before '*' token
ldapmod.c:28: error: expected ')' before '*' token
ldapmod.c:108: error: expected ')' before '*' token
ldapmod.c:129: error: expected ')' before '*' token
In file included from ldapwrite.c:27:
ldapdiff.h:172: error: expected ')' before '*' token
ldapmod.c:216: error: expected ')' before '*' token
ldapdiff.h:173: error: expected ')' before '*' token
ldapdiff.h:176: error: expected ')' before '*' token
ldapdiff.h:179: error: expected ')' before '*' token
ldapdiff.h:213: error: expected ')' before '*' token
ldapdiff.h:172: error: expected ')' before '*' token
ldapdiff.h:173: error: expected ')' before '*' token
ldapdiff.h:176: error: expected ')' before '*' token
ldapdiff.h:227: error: expected ')' before '*' token
ldapdiff.h:234: error: expected ')' before '*' token
ldapdiff.h:235: error: expected ')' before '*' token
In file included from ldapiter.c:26:
ldapdiff.h:172: error: expected ')' before '*' token
ldapdiff.h:173: error: expected ')' before '*' token
ldapdiff.h:176: error: expected ')' before '*' token
ldapdiff.h:179: error: expected ')' before '*' token
ldapdiff.h:213: error: expected ')' before '*' token
ldapdiff.h:227: error: expected ')' before '*' token
ldapdiff.h:234: error: expected ')' before '*' token
ldapdiff.h:235: error: expected ')' before '*' token
ldapiter.c:28: error: expected ')' before '*' token
ldapdiff.h:179: error: expected ')' before '*' token
ldapdiff.h:213: error: expected ')' before '*' token
ldapdiff.h:227: error: expected ')' before '*' token
*** [ldapmod.o] Error code 1
ldapdiff.h:234: error: expected ')' before '*' token
ldapdiff.h:235: error: expected ')' before '*' token
ldapiter.c:182: error: expected ')' before '*' token
In file included from ldapmisc.c:29:
ldapdiff.h:172: error: expected ')' before '*' token
ldapdiff.h:173: error: expected ')' before '*' token
ldapdiff.h:176: error: expected ')' before '*' token
ldapdiff.h:179: error: expected ')' before '*' token
*** [ldapiter.o] Error code 1
ldapdiff.h:213: error: expected ')' before '*' token
ldapdiff.h:227: error: expected ')' before '*' token
ldapdiff.h:234: error: expected ')' before '*' token
ldapdiff.h:235: error: expected ')' before '*' token
ldapmisc.c: In function 'ldifnormalizedn':
ldapmisc.c:33: error: 'LDAPDN' undeclared (first use in this function)
ldapmisc.c:33: error: (Each undeclared identifier is reported only once
ldapmisc.c:33: error: for each function it appears in.)
ldapmisc.c:33: error: expected ';' before 'ldn'
ldapmisc.c:37: error: 'ldn' undeclared (first use in this function)
ldapmisc.c:37: error: 'LDAP_DN_FORMAT_LDAPV3' undeclared (first use in this function)
ldapmisc.c:37: error: 'LDAP_SUCCESS' undeclared (first use in this function)
ldapmisc.c: In function 'ldifgetscope':
ldapmisc.c:58: error: 'LDAP_SCOPE_SUBTREE' undeclared (first use in this function)
ldapmisc.c:64: error: 'LDAP_SCOPE_BASE' undeclared (first use in this function)
ldapmisc.c:67: error: 'LDAP_SCOPE_ONELEVEL' undeclared (first use in this function)
In file included from ldapread.c:26:
ldapdiff.h:172: error: expected ')' before '*' token
ldapdiff.h:173: error: expected ')' before '*' token
ldapdiff.h:176: error: expected ')' before '*' token
ldapdiff.h:179: error: expected ')' before '*' token
*** [ldapwrite.o] Error code 1
ldapdiff.h:213: error: expected ')' before '*' token
In file included from ldapstats.c:26:
ldapdiff.h:172: error: expected ')' before '*' token
ldapdiff.h:227: error: expected ')' before '*' token
ldapdiff.h:173: error: expected ')' before '*' token
ldapdiff.h:176: error: expected ')' before '*' token
ldapdiff.h:234: error: expected ')' before '*' token
ldapdiff.h:179: error: expected ')' before '*' token
ldapdiff.h:235: error: expected ')' before '*' token
ldapcmp.c:114: error: expected ')' before '*' token
ldapdiff.h:213: error: expected ')' before '*' token
ldapdiff.h:227: error: expected ')' before '*' token
ldapdiff.h:234: error: expected ')' before '*' token
ldapdiff.h:235: error: expected ')' before '*' token
ldapcmp.c:336: error: expected ')' before '*' token
In file included from ldapconf.c:27:
ldapdiff.h:172: error: expected ')' before '*' token
ldapdiff.h:173: error: expected ')' before '*' token
ldapdiff.h:176: error: expected ')' before '*' token
ldapdiff.h:179: error: expected ')' before '*' token
ldapdiff.h:213: error: expected ')' before '*' token
ldapdiff.h:227: error: expected ')' before '*' token
*** [ldapstats.o] Error code 1
ldapdiff.h:234: error: expected ')' before '*' token
ldapdiff.h:235: error: expected ')' before '*' token
*** [ldapcmp.o] Error code 1
*** [ldapread.o] Error code 1
*** [ldapmisc.o] Error code 1
*** [ldapconf.o] Error code 1
8 errors
*** [all] Error code 2
1 error
===> Compilation failed unexpectedly.
Try to set MAKE_JOBS_UNSAFE=yes and rebuild before reporting the failure to
the maintainer.
*** [do-build] Error code 1

Stop in /usr/mports/net/ldapdiff.

Links

Depends On

Depend Of

Nothing

Categories