MidnightBSD Magus

devel/py-setuptools

Python packages installer

Flavor Version Run OSVersion Arch License Restricted Status
py27 40.4.3 367 1.1 amd64 mit 0 fail

Events

Machine Type Time Message
m1164 fail 2019-03-03 20:41:56.69218 Test complete.
m1164 fail 2019-03-03 20:41:56.557065 make test returned non-zero: 1
m1164 info 2019-03-03 20:41:36.062295 Test Started

Log

===>  Testing for py27-setuptools-40.4.3
===>   py27-setuptools-40.4.3 depends on file: /usr/local/bin/python2.7 - found
running test
running egg_info
writing requirements to setuptools.egg-info/requires.txt
writing setuptools.egg-info/PKG-INFO
writing top-level names to setuptools.egg-info/top_level.txt
writing dependency_links to setuptools.egg-info/dependency_links.txt
writing entry points to setuptools.egg-info/entry_points.txt
reading manifest file 'setuptools.egg-info/SOURCES.txt'
reading manifest template 'MANIFEST.in'
writing manifest file 'setuptools.egg-info/SOURCES.txt'
running build_ext
pkg_resources.tests.test_find_distributions (unittest.loader.ModuleImportFailure) ... ERROR
pkg_resources.tests.test_markers (unittest.loader.ModuleImportFailure) ... ERROR
pkg_resources.tests.test_pkg_resources (unittest.loader.ModuleImportFailure) ... ERROR
pkg_resources.tests.test_resources (unittest.loader.ModuleImportFailure) ... ERROR
pkg_resources.tests.test_working_set (unittest.loader.ModuleImportFailure) ... ERROR
setuptools.tests.test_archive_util (unittest.loader.ModuleImportFailure) ... ERROR
setuptools.tests.test_bdist_egg (unittest.loader.ModuleImportFailure) ... ERROR
setuptools.tests.test_build_clib (unittest.loader.ModuleImportFailure) ... ERROR
setuptools.tests.test_build_ext (unittest.loader.ModuleImportFailure) ... ERROR
setuptools.tests.test_build_meta (unittest.loader.ModuleImportFailure) ... ERROR
setuptools.tests.test_build_py (unittest.loader.ModuleImportFailure) ... ERROR
setuptools.tests.test_config (unittest.loader.ModuleImportFailure) ... ERROR
setuptools.tests.test_dep_util (unittest.loader.ModuleImportFailure) ... ERROR
setuptools.tests.test_depends (unittest.loader.ModuleImportFailure) ... ERROR
setuptools.tests.test_develop (unittest.loader.ModuleImportFailure) ... ERROR
setuptools.tests.test_dist (unittest.loader.ModuleImportFailure) ... ERROR
setuptools.tests.test_dist_info (unittest.loader.ModuleImportFailure) ... ERROR
setuptools.tests.test_easy_install (unittest.loader.ModuleImportFailure) ... ERROR
setuptools.tests.test_egg_info (unittest.loader.ModuleImportFailure) ... ERROR
setuptools.tests.test_find_packages (unittest.loader.ModuleImportFailure) ... ERROR
setuptools.tests.test_glibc (unittest.loader.ModuleImportFailure) ... ERROR
setuptools.tests.test_glob (unittest.loader.ModuleImportFailure) ... ERROR
setuptools.tests.test_install_scripts (unittest.loader.ModuleImportFailure) ... ERROR
setuptools.tests.test_integration (unittest.loader.ModuleImportFailure) ... ERROR
setuptools.tests.test_manifest (unittest.loader.ModuleImportFailure) ... ERROR
setuptools.tests.test_msvc (unittest.loader.ModuleImportFailure) ... ERROR
setuptools.tests.test_namespaces (unittest.loader.ModuleImportFailure) ... ERROR
setuptools.tests.test_packageindex (unittest.loader.ModuleImportFailure) ... ERROR
setuptools.tests.test_pep425tags (unittest.loader.ModuleImportFailure) ... ERROR
setuptools.tests.test_register (unittest.loader.ModuleImportFailure) ... ERROR
setuptools.tests.test_sandbox (unittest.loader.ModuleImportFailure) ... ERROR
setuptools.tests.test_sdist (unittest.loader.ModuleImportFailure) ... ERROR
setuptools.tests.test_setuptools (unittest.loader.ModuleImportFailure) ... ERROR
setuptools.tests.test_test (unittest.loader.ModuleImportFailure) ... ERROR
setuptools.tests.test_unicode_utils (unittest.loader.ModuleImportFailure) ... ERROR
setuptools.tests.test_upload (unittest.loader.ModuleImportFailure) ... ERROR
setuptools.tests.test_upload_docs (unittest.loader.ModuleImportFailure) ... ERROR
setuptools.tests.test_virtualenv (unittest.loader.ModuleImportFailure) ... ERROR
setuptools.tests.test_wheel (unittest.loader.ModuleImportFailure) ... ERROR
setuptools.tests.test_windows_wrappers (unittest.loader.ModuleImportFailure) ... ERROR

======================================================================
ERROR: pkg_resources.tests.test_find_distributions (unittest.loader.ModuleImportFailure)
----------------------------------------------------------------------
ImportError: Failed to import test module: pkg_resources.tests.test_find_distributions
Traceback (most recent call last):
  File "/usr/local/lib/python2.7/unittest/loader.py", line 254, in _find_tests
    module = self._get_module_from_name(name)
  File "/usr/local/lib/python2.7/unittest/loader.py", line 232, in _get_module_from_name
    __import__(name)
  File "/magus/work/usr/mports/devel/py-setuptools/work-py27/setuptools-40.4.3/pkg_resources/tests/test_find_distributions.py", line 4, in 
    import pytest
ImportError: No module named pytest


======================================================================
ERROR: pkg_resources.tests.test_markers (unittest.loader.ModuleImportFailure)
----------------------------------------------------------------------
ImportError: Failed to import test module: pkg_resources.tests.test_markers
Traceback (most recent call last):
  File "/usr/local/lib/python2.7/unittest/loader.py", line 254, in _find_tests
    module = self._get_module_from_name(name)
  File "/usr/local/lib/python2.7/unittest/loader.py", line 232, in _get_module_from_name
    __import__(name)
  File "/magus/work/usr/mports/devel/py-setuptools/work-py27/setuptools-40.4.3/pkg_resources/tests/test_markers.py", line 1, in 
    import mock
ImportError: No module named mock


======================================================================
ERROR: pkg_resources.tests.test_pkg_resources (unittest.loader.ModuleImportFailure)
----------------------------------------------------------------------
ImportError: Failed to import test module: pkg_resources.tests.test_pkg_resources
Traceback (most recent call last):
  File "/usr/local/lib/python2.7/unittest/loader.py", line 254, in _find_tests
    module = self._get_module_from_name(name)
  File "/usr/local/lib/python2.7/unittest/loader.py", line 232, in _get_module_from_name
    __import__(name)
  File "/magus/work/usr/mports/devel/py-setuptools/work-py27/setuptools-40.4.3/pkg_resources/tests/test_pkg_resources.py", line 18, in 
    import mock
ImportError: No module named mock


======================================================================
ERROR: pkg_resources.tests.test_resources (unittest.loader.ModuleImportFailure)
----------------------------------------------------------------------
ImportError: Failed to import test module: pkg_resources.tests.test_resources
Traceback (most recent call last):
  File "/usr/local/lib/python2.7/unittest/loader.py", line 254, in _find_tests
    module = self._get_module_from_name(name)
  File "/usr/local/lib/python2.7/unittest/loader.py", line 232, in _get_module_from_name
    __import__(name)
  File "/magus/work/usr/mports/devel/py-setuptools/work-py27/setuptools-40.4.3/pkg_resources/tests/test_resources.py", line 11, in 
    import pytest
ImportError: No module named pytest


======================================================================
ERROR: pkg_resources.tests.test_working_set (unittest.loader.ModuleImportFailure)
----------------------------------------------------------------------
ImportError: Failed to import test module: pkg_resources.tests.test_working_set
Traceback (most recent call last):
  File "/usr/local/lib/python2.7/unittest/loader.py", line 254, in _find_tests
    module = self._get_module_from_name(name)
  File "/usr/local/lib/python2.7/unittest/loader.py", line 232, in _get_module_from_name
    __import__(name)
  File "/magus/work/usr/mports/devel/py-setuptools/work-py27/setuptools-40.4.3/pkg_resources/tests/test_working_set.py", line 6, in 
    import pytest
ImportError: No module named pytest


======================================================================
ERROR: setuptools.tests.test_archive_util (unittest.loader.ModuleImportFailure)
----------------------------------------------------------------------
ImportError: Failed to import test module: setuptools.tests.test_archive_util
Traceback (most recent call last):
  File "/usr/local/lib/python2.7/unittest/loader.py", line 254, in _find_tests
    module = self._get_module_from_name(name)
  File "/usr/local/lib/python2.7/unittest/loader.py", line 232, in _get_module_from_name
    __import__(name)
  File "/magus/work/usr/mports/devel/py-setuptools/work-py27/setuptools-40.4.3/setuptools/tests/__init__.py", line 3, in 
    import pytest
ImportError: No module named pytest


======================================================================
ERROR: setuptools.tests.test_bdist_egg (unittest.loader.ModuleImportFailure)
----------------------------------------------------------------------
ImportError: Failed to import test module: setuptools.tests.test_bdist_egg
Traceback (most recent call last):
  File "/usr/local/lib/python2.7/unittest/loader.py", line 254, in _find_tests
    module = self._get_module_from_name(name)
  File "/usr/local/lib/python2.7/unittest/loader.py", line 232, in _get_module_from_name
    __import__(name)
  File "/magus/work/usr/mports/devel/py-setuptools/work-py27/setuptools-40.4.3/setuptools/tests/__init__.py", line 3, in 
    import pytest
ImportError: No module named pytest


======================================================================
ERROR: setuptools.tests.test_build_clib (unittest.loader.ModuleImportFailure)
----------------------------------------------------------------------
ImportError: Failed to import test module: setuptools.tests.test_build_clib
Traceback (most recent call last):
  File "/usr/local/lib/python2.7/unittest/loader.py", line 254, in _find_tests
    module = self._get_module_from_name(name)
  File "/usr/local/lib/python2.7/unittest/loader.py", line 232, in _get_module_from_name
    __import__(name)
  File "/magus/work/usr/mports/devel/py-setuptools/work-py27/setuptools-40.4.3/setuptools/tests/__init__.py", line 3, in 
    import pytest
ImportError: No module named pytest


======================================================================
ERROR: setuptools.tests.test_build_ext (unittest.loader.ModuleImportFailure)
----------------------------------------------------------------------
ImportError: Failed to import test module: setuptools.tests.test_build_ext
Traceback (most recent call last):
  File "/usr/local/lib/python2.7/unittest/loader.py", line 254, in _find_tests
    module = self._get_module_from_name(name)
  File "/usr/local/lib/python2.7/unittest/loader.py", line 232, in _get_module_from_name
    __import__(name)
  File "/magus/work/usr/mports/devel/py-setuptools/work-py27/setuptools-40.4.3/setuptools/tests/__init__.py", line 3, in 
    import pytest
ImportError: No module named pytest


======================================================================
ERROR: setuptools.tests.test_build_meta (unittest.loader.ModuleImportFailure)
----------------------------------------------------------------------
ImportError: Failed to import test module: setuptools.tests.test_build_meta
Traceback (most recent call last):
  File "/usr/local/lib/python2.7/unittest/loader.py", line 254, in _find_tests
    module = self._get_module_from_name(name)
  File "/usr/local/lib/python2.7/unittest/loader.py", line 232, in _get_module_from_name
    __import__(name)
  File "/magus/work/usr/mports/devel/py-setuptools/work-py27/setuptools-40.4.3/setuptools/tests/__init__.py", line 3, in 
    import pytest
ImportError: No module named pytest


======================================================================
ERROR: setuptools.tests.test_build_py (unittest.loader.ModuleImportFailure)
----------------------------------------------------------------------
ImportError: Failed to import test module: setuptools.tests.test_build_py
Traceback (most recent call last):
  File "/usr/local/lib/python2.7/unittest/loader.py", line 254, in _find_tests
    module = self._get_module_from_name(name)
  File "/usr/local/lib/python2.7/unittest/loader.py", line 232, in _get_module_from_name
    __import__(name)
  File "/magus/work/usr/mports/devel/py-setuptools/work-py27/setuptools-40.4.3/setuptools/tests/__init__.py", line 3, in 
    import pytest
ImportError: No module named pytest


======================================================================
ERROR: setuptools.tests.test_config (unittest.loader.ModuleImportFailure)
----------------------------------------------------------------------
ImportError: Failed to import test module: setuptools.tests.test_config
Traceback (most recent call last):
  File "/usr/local/lib/python2.7/unittest/loader.py", line 254, in _find_tests
    module = self._get_module_from_name(name)
  File "/usr/local/lib/python2.7/unittest/loader.py", line 232, in _get_module_from_name
    __import__(name)
  File "/magus/work/usr/mports/devel/py-setuptools/work-py27/setuptools-40.4.3/setuptools/tests/__init__.py", line 3, in 
    import pytest
ImportError: No module named pytest


======================================================================
ERROR: setuptools.tests.test_dep_util (unittest.loader.ModuleImportFailure)
----------------------------------------------------------------------
ImportError: Failed to import test module: setuptools.tests.test_dep_util
Traceback (most recent call last):
  File "/usr/local/lib/python2.7/unittest/loader.py", line 254, in _find_tests
    module = self._get_module_from_name(name)
  File "/usr/local/lib/python2.7/unittest/loader.py", line 232, in _get_module_from_name
    __import__(name)
  File "/magus/work/usr/mports/devel/py-setuptools/work-py27/setuptools-40.4.3/setuptools/tests/__init__.py", line 3, in 
    import pytest
ImportError: No module named pytest


======================================================================
ERROR: setuptools.tests.test_depends (unittest.loader.ModuleImportFailure)
----------------------------------------------------------------------
ImportError: Failed to import test module: setuptools.tests.test_depends
Traceback (most recent call last):
  File "/usr/local/lib/python2.7/unittest/loader.py", line 254, in _find_tests
    module = self._get_module_from_name(name)
  File "/usr/local/lib/python2.7/unittest/loader.py", line 232, in _get_module_from_name
    __import__(name)
  File "/magus/work/usr/mports/devel/py-setuptools/work-py27/setuptools-40.4.3/setuptools/tests/__init__.py", line 3, in 
    import pytest
ImportError: No module named pytest


======================================================================
ERROR: setuptools.tests.test_develop (unittest.loader.ModuleImportFailure)
----------------------------------------------------------------------
ImportError: Failed to import test module: setuptools.tests.test_develop
Traceback (most recent call last):
  File "/usr/local/lib/python2.7/unittest/loader.py", line 254, in _find_tests
    module = self._get_module_from_name(name)
  File "/usr/local/lib/python2.7/unittest/loader.py", line 232, in _get_module_from_name
    __import__(name)
  File "/magus/work/usr/mports/devel/py-setuptools/work-py27/setuptools-40.4.3/setuptools/tests/__init__.py", line 3, in 
    import pytest
ImportError: No module named pytest


======================================================================
ERROR: setuptools.tests.test_dist (unittest.loader.ModuleImportFailure)
----------------------------------------------------------------------
ImportError: Failed to import test module: setuptools.tests.test_dist
Traceback (most recent call last):
  File "/usr/local/lib/python2.7/unittest/loader.py", line 254, in _find_tests
    module = self._get_module_from_name(name)
  File "/usr/local/lib/python2.7/unittest/loader.py", line 232, in _get_module_from_name
    __import__(name)
  File "/magus/work/usr/mports/devel/py-setuptools/work-py27/setuptools-40.4.3/setuptools/tests/__init__.py", line 3, in 
    import pytest
ImportError: No module named pytest


======================================================================
ERROR: setuptools.tests.test_dist_info (unittest.loader.ModuleImportFailure)
----------------------------------------------------------------------
ImportError: Failed to import test module: setuptools.tests.test_dist_info
Traceback (most recent call last):
  File "/usr/local/lib/python2.7/unittest/loader.py", line 254, in _find_tests
    module = self._get_module_from_name(name)
  File "/usr/local/lib/python2.7/unittest/loader.py", line 232, in _get_module_from_name
    __import__(name)
  File "/magus/work/usr/mports/devel/py-setuptools/work-py27/setuptools-40.4.3/setuptools/tests/__init__.py", line 3, in 
    import pytest
ImportError: No module named pytest


======================================================================
ERROR: setuptools.tests.test_easy_install (unittest.loader.ModuleImportFailure)
----------------------------------------------------------------------
ImportError: Failed to import test module: setuptools.tests.test_easy_install
Traceback (most recent call last):
  File "/usr/local/lib/python2.7/unittest/loader.py", line 254, in _find_tests
    module = self._get_module_from_name(name)
  File "/usr/local/lib/python2.7/unittest/loader.py", line 232, in _get_module_from_name
    __import__(name)
  File "/magus/work/usr/mports/devel/py-setuptools/work-py27/setuptools-40.4.3/setuptools/tests/__init__.py", line 3, in 
    import pytest
ImportError: No module named pytest


======================================================================
ERROR: setuptools.tests.test_egg_info (unittest.loader.ModuleImportFailure)
----------------------------------------------------------------------
ImportError: Failed to import test module: setuptools.tests.test_egg_info
Traceback (most recent call last):
  File "/usr/local/lib/python2.7/unittest/loader.py", line 254, in _find_tests
    module = self._get_module_from_name(name)
  File "/usr/local/lib/python2.7/unittest/loader.py", line 232, in _get_module_from_name
    __import__(name)
  File "/magus/work/usr/mports/devel/py-setuptools/work-py27/setuptools-40.4.3/setuptools/tests/__init__.py", line 3, in 
    import pytest
ImportError: No module named pytest


======================================================================
ERROR: setuptools.tests.test_find_packages (unittest.loader.ModuleImportFailure)
----------------------------------------------------------------------
ImportError: Failed to import test module: setuptools.tests.test_find_packages
Traceback (most recent call last):
  File "/usr/local/lib/python2.7/unittest/loader.py", line 254, in _find_tests
    module = self._get_module_from_name(name)
  File "/usr/local/lib/python2.7/unittest/loader.py", line 232, in _get_module_from_name
    __import__(name)
  File "/magus/work/usr/mports/devel/py-setuptools/work-py27/setuptools-40.4.3/setuptools/tests/__init__.py", line 3, in 
    import pytest
ImportError: No module named pytest


======================================================================
ERROR: setuptools.tests.test_glibc (unittest.loader.ModuleImportFailure)
----------------------------------------------------------------------
ImportError: Failed to import test module: setuptools.tests.test_glibc
Traceback (most recent call last):
  File "/usr/local/lib/python2.7/unittest/loader.py", line 254, in _find_tests
    module = self._get_module_from_name(name)
  File "/usr/local/lib/python2.7/unittest/loader.py", line 232, in _get_module_from_name
    __import__(name)
  File "/magus/work/usr/mports/devel/py-setuptools/work-py27/setuptools-40.4.3/setuptools/tests/__init__.py", line 3, in 
    import pytest
ImportError: No module named pytest


======================================================================
ERROR: setuptools.tests.test_glob (unittest.loader.ModuleImportFailure)
----------------------------------------------------------------------
ImportError: Failed to import test module: setuptools.tests.test_glob
Traceback (most recent call last):
  File "/usr/local/lib/python2.7/unittest/loader.py", line 254, in _find_tests
    module = self._get_module_from_name(name)
  File "/usr/local/lib/python2.7/unittest/loader.py", line 232, in _get_module_from_name
    __import__(name)
  File "/magus/work/usr/mports/devel/py-setuptools/work-py27/setuptools-40.4.3/setuptools/tests/__init__.py", line 3, in 
    import pytest
ImportError: No module named pytest


======================================================================
ERROR: setuptools.tests.test_install_scripts (unittest.loader.ModuleImportFailure)
----------------------------------------------------------------------
ImportError: Failed to import test module: setuptools.tests.test_install_scripts
Traceback (most recent call last):
  File "/usr/local/lib/python2.7/unittest/loader.py", line 254, in _find_tests
    module = self._get_module_from_name(name)
  File "/usr/local/lib/python2.7/unittest/loader.py", line 232, in _get_module_from_name
    __import__(name)
  File "/magus/work/usr/mports/devel/py-setuptools/work-py27/setuptools-40.4.3/setuptools/tests/__init__.py", line 3, in 
    import pytest
ImportError: No module named pytest


======================================================================
ERROR: setuptools.tests.test_integration (unittest.loader.ModuleImportFailure)
----------------------------------------------------------------------
ImportError: Failed to import test module: setuptools.tests.test_integration
Traceback (most recent call last):
  File "/usr/local/lib/python2.7/unittest/loader.py", line 254, in _find_tests
    module = self._get_module_from_name(name)
  File "/usr/local/lib/python2.7/unittest/loader.py", line 232, in _get_module_from_name
    __import__(name)
  File "/magus/work/usr/mports/devel/py-setuptools/work-py27/setuptools-40.4.3/setuptools/tests/__init__.py", line 3, in 
    import pytest
ImportError: No module named pytest


======================================================================
ERROR: setuptools.tests.test_manifest (unittest.loader.ModuleImportFailure)
----------------------------------------------------------------------
ImportError: Failed to import test module: setuptools.tests.test_manifest
Traceback (most recent call last):
  File "/usr/local/lib/python2.7/unittest/loader.py", line 254, in _find_tests
    module = self._get_module_from_name(name)
  File "/usr/local/lib/python2.7/unittest/loader.py", line 232, in _get_module_from_name
    __import__(name)
  File "/magus/work/usr/mports/devel/py-setuptools/work-py27/setuptools-40.4.3/setuptools/tests/__init__.py", line 3, in 
    import pytest
ImportError: No module named pytest


======================================================================
ERROR: setuptools.tests.test_msvc (unittest.loader.ModuleImportFailure)
----------------------------------------------------------------------
ImportError: Failed to import test module: setuptools.tests.test_msvc
Traceback (most recent call last):
  File "/usr/local/lib/python2.7/unittest/loader.py", line 254, in _find_tests
    module = self._get_module_from_name(name)
  File "/usr/local/lib/python2.7/unittest/loader.py", line 232, in _get_module_from_name
    __import__(name)
  File "/magus/work/usr/mports/devel/py-setuptools/work-py27/setuptools-40.4.3/setuptools/tests/__init__.py", line 3, in 
    import pytest
ImportError: No module named pytest


======================================================================
ERROR: setuptools.tests.test_namespaces (unittest.loader.ModuleImportFailure)
----------------------------------------------------------------------
ImportError: Failed to import test module: setuptools.tests.test_namespaces
Traceback (most recent call last):
  File "/usr/local/lib/python2.7/unittest/loader.py", line 254, in _find_tests
    module = self._get_module_from_name(name)
  File "/usr/local/lib/python2.7/unittest/loader.py", line 232, in _get_module_from_name
    __import__(name)
  File "/magus/work/usr/mports/devel/py-setuptools/work-py27/setuptools-40.4.3/setuptools/tests/__init__.py", line 3, in 
    import pytest
ImportError: No module named pytest


======================================================================
ERROR: setuptools.tests.test_packageindex (unittest.loader.ModuleImportFailure)
----------------------------------------------------------------------
ImportError: Failed to import test module: setuptools.tests.test_packageindex
Traceback (most recent call last):
  File "/usr/local/lib/python2.7/unittest/loader.py", line 254, in _find_tests
    module = self._get_module_from_name(name)
  File "/usr/local/lib/python2.7/unittest/loader.py", line 232, in _get_module_from_name
    __import__(name)
  File "/magus/work/usr/mports/devel/py-setuptools/work-py27/setuptools-40.4.3/setuptools/tests/__init__.py", line 3, in 
    import pytest
ImportError: No module named pytest


======================================================================
ERROR: setuptools.tests.test_pep425tags (unittest.loader.ModuleImportFailure)
----------------------------------------------------------------------
ImportError: Failed to import test module: setuptools.tests.test_pep425tags
Traceback (most recent call last):
  File "/usr/local/lib/python2.7/unittest/loader.py", line 254, in _find_tests
    module = self._get_module_from_name(name)
  File "/usr/local/lib/python2.7/unittest/loader.py", line 232, in _get_module_from_name
    __import__(name)
  File "/magus/work/usr/mports/devel/py-setuptools/work-py27/setuptools-40.4.3/setuptools/tests/__init__.py", line 3, in 
    import pytest
ImportError: No module named pytest


======================================================================
ERROR: setuptools.tests.test_register (unittest.loader.ModuleImportFailure)
----------------------------------------------------------------------
ImportError: Failed to import test module: setuptools.tests.test_register
Traceback (most recent call last):
  File "/usr/local/lib/python2.7/unittest/loader.py", line 254, in _find_tests
    module = self._get_module_from_name(name)
  File "/usr/local/lib/python2.7/unittest/loader.py", line 232, in _get_module_from_name
    __import__(name)
  File "/magus/work/usr/mports/devel/py-setuptools/work-py27/setuptools-40.4.3/setuptools/tests/__init__.py", line 3, in 
    import pytest
ImportError: No module named pytest


======================================================================
ERROR: setuptools.tests.test_sandbox (unittest.loader.ModuleImportFailure)
----------------------------------------------------------------------
ImportError: Failed to import test module: setuptools.tests.test_sandbox
Traceback (most recent call last):
  File "/usr/local/lib/python2.7/unittest/loader.py", line 254, in _find_tests
    module = self._get_module_from_name(name)
  File "/usr/local/lib/python2.7/unittest/loader.py", line 232, in _get_module_from_name
    __import__(name)
  File "/magus/work/usr/mports/devel/py-setuptools/work-py27/setuptools-40.4.3/setuptools/tests/__init__.py", line 3, in 
    import pytest
ImportError: No module named pytest


======================================================================
ERROR: setuptools.tests.test_sdist (unittest.loader.ModuleImportFailure)
----------------------------------------------------------------------
ImportError: Failed to import test module: setuptools.tests.test_sdist
Traceback (most recent call last):
  File "/usr/local/lib/python2.7/unittest/loader.py", line 254, in _find_tests
    module = self._get_module_from_name(name)
  File "/usr/local/lib/python2.7/unittest/loader.py", line 232, in _get_module_from_name
    __import__(name)
  File "/magus/work/usr/mports/devel/py-setuptools/work-py27/setuptools-40.4.3/setuptools/tests/__init__.py", line 3, in 
    import pytest
ImportError: No module named pytest


======================================================================
ERROR: setuptools.tests.test_setuptools (unittest.loader.ModuleImportFailure)
----------------------------------------------------------------------
ImportError: Failed to import test module: setuptools.tests.test_setuptools
Traceback (most recent call last):
  File "/usr/local/lib/python2.7/unittest/loader.py", line 254, in _find_tests
    module = self._get_module_from_name(name)
  File "/usr/local/lib/python2.7/unittest/loader.py", line 232, in _get_module_from_name
    __import__(name)
  File "/magus/work/usr/mports/devel/py-setuptools/work-py27/setuptools-40.4.3/setuptools/tests/__init__.py", line 3, in 
    import pytest
ImportError: No module named pytest


======================================================================
ERROR: setuptools.tests.test_test (unittest.loader.ModuleImportFailure)
----------------------------------------------------------------------
ImportError: Failed to import test module: setuptools.tests.test_test
Traceback (most recent call last):
  File "/usr/local/lib/python2.7/unittest/loader.py", line 254, in _find_tests
    module = self._get_module_from_name(name)
  File "/usr/local/lib/python2.7/unittest/loader.py", line 232, in _get_module_from_name
    __import__(name)
  File "/magus/work/usr/mports/devel/py-setuptools/work-py27/setuptools-40.4.3/setuptools/tests/__init__.py", line 3, in 
    import pytest
ImportError: No module named pytest


======================================================================
ERROR: setuptools.tests.test_unicode_utils (unittest.loader.ModuleImportFailure)
----------------------------------------------------------------------
ImportError: Failed to import test module: setuptools.tests.test_unicode_utils
Traceback (most recent call last):
  File "/usr/local/lib/python2.7/unittest/loader.py", line 254, in _find_tests
    module = self._get_module_from_name(name)
  File "/usr/local/lib/python2.7/unittest/loader.py", line 232, in _get_module_from_name
    __import__(name)
  File "/magus/work/usr/mports/devel/py-setuptools/work-py27/setuptools-40.4.3/setuptools/tests/__init__.py", line 3, in 
    import pytest
ImportError: No module named pytest


======================================================================
ERROR: setuptools.tests.test_upload (unittest.loader.ModuleImportFailure)
----------------------------------------------------------------------
ImportError: Failed to import test module: setuptools.tests.test_upload
Traceback (most recent call last):
  File "/usr/local/lib/python2.7/unittest/loader.py", line 254, in _find_tests
    module = self._get_module_from_name(name)
  File "/usr/local/lib/python2.7/unittest/loader.py", line 232, in _get_module_from_name
    __import__(name)
  File "/magus/work/usr/mports/devel/py-setuptools/work-py27/setuptools-40.4.3/setuptools/tests/__init__.py", line 3, in 
    import pytest
ImportError: No module named pytest


======================================================================
ERROR: setuptools.tests.test_upload_docs (unittest.loader.ModuleImportFailure)
----------------------------------------------------------------------
ImportError: Failed to import test module: setuptools.tests.test_upload_docs
Traceback (most recent call last):
  File "/usr/local/lib/python2.7/unittest/loader.py", line 254, in _find_tests
    module = self._get_module_from_name(name)
  File "/usr/local/lib/python2.7/unittest/loader.py", line 232, in _get_module_from_name
    __import__(name)
  File "/magus/work/usr/mports/devel/py-setuptools/work-py27/setuptools-40.4.3/setuptools/tests/__init__.py", line 3, in 
    import pytest
ImportError: No module named pytest


======================================================================
ERROR: setuptools.tests.test_virtualenv (unittest.loader.ModuleImportFailure)
----------------------------------------------------------------------
ImportError: Failed to import test module: setuptools.tests.test_virtualenv
Traceback (most recent call last):
  File "/usr/local/lib/python2.7/unittest/loader.py", line 254, in _find_tests
    module = self._get_module_from_name(name)
  File "/usr/local/lib/python2.7/unittest/loader.py", line 232, in _get_module_from_name
    __import__(name)
  File "/magus/work/usr/mports/devel/py-setuptools/work-py27/setuptools-40.4.3/setuptools/tests/__init__.py", line 3, in 
    import pytest
ImportError: No module named pytest


======================================================================
ERROR: setuptools.tests.test_wheel (unittest.loader.ModuleImportFailure)
----------------------------------------------------------------------
ImportError: Failed to import test module: setuptools.tests.test_wheel
Traceback (most recent call last):
  File "/usr/local/lib/python2.7/unittest/loader.py", line 254, in _find_tests
    module = self._get_module_from_name(name)
  File "/usr/local/lib/python2.7/unittest/loader.py", line 232, in _get_module_from_name
    __import__(name)
  File "/magus/work/usr/mports/devel/py-setuptools/work-py27/setuptools-40.4.3/setuptools/tests/__init__.py", line 3, in 
    import pytest
ImportError: No module named pytest


======================================================================
ERROR: setuptools.tests.test_windows_wrappers (unittest.loader.ModuleImportFailure)
----------------------------------------------------------------------
ImportError: Failed to import test module: setuptools.tests.test_windows_wrappers
Traceback (most recent call last):
  File "/usr/local/lib/python2.7/unittest/loader.py", line 254, in _find_tests
    module = self._get_module_from_name(name)
  File "/usr/local/lib/python2.7/unittest/loader.py", line 232, in _get_module_from_name
    __import__(name)
  File "/magus/work/usr/mports/devel/py-setuptools/work-py27/setuptools-40.4.3/setuptools/tests/__init__.py", line 3, in 
    import pytest
ImportError: No module named pytest


----------------------------------------------------------------------
Ran 40 tests in 0.002s

FAILED (errors=40)
Test failed: 
error: Test failed: 
*** Error code 1

Stop.
make: stopped in /usr/mports/devel/py-setuptools

Links

Depends On

Depend Of

Categories