MidnightBSD Magus

net-p2p/rtorrent

BitTorrent Client written in C++

Flavor Version Run OSVersion Arch License Restricted Status
0.9.6_1 395 1.2 i386 gpl2 gpl3 0 fail

Events

Machine Type Time Message
m1232 info 2020-01-04 15:20:32.28663 Test Started
m1232 fail 2020-01-04 15:20:40.831177 make build returned non-zero: 1
m1232 fail 2020-01-04 15:20:40.877883 Test complete.

Log

===>  Building for rtorrent-0.9.6_1
/usr/bin/make  all-recursive
Making all in doc
Making all in src
Making all in core
c++ -DHAVE_CONFIG_H -I. -I../..   -I. -I./.. -I../..   -O2 -pipe  -fno-strict-aliasing  -std=c++11 -DNDEBUG   -I/usr/local/include  -I/usr/local/include  -I/usr/local/include -MT curl_get.o -MD -MP -MF .deps/curl_get.Tpo -c -o curl_get.o curl_get.cc
In file included from curl_get.cc:44:
In file included from ./../globals.h:43:
In file included from ./../thread_base.h:42:
In file included from /usr/local/include/torrent/utils/thread_base.h:43:
/usr/local/include/torrent/utils/signal_bitfield.h:40:10: error: expected "FILENAME" or 
#include lt_tr1_functional
         ^
In file included from curl_get.cc:44:
In file included from ./../globals.h:43:
In file included from ./../thread_base.h:42:
/usr/local/include/torrent/utils/thread_base.h:44:10: error: expected "FILENAME" or 
#include lt_tr1_functional
         ^
In file included from curl_get.cc:44:
In file included from ./../globals.h:45:
./../rpc/ip_table_list.h:48:41: error: template argument for template type parameter must be a type
typedef torrent::extents ipv4_table;
                                        ^~
/usr/local/include/torrent/utils/extents.h:46:45: note: template parameter is declared here
template  >
                                            ^
In file included from curl_get.cc:45:
In file included from ./curl_get.h:43:
/usr/local/include/torrent/http.h:43:10: error: expected "FILENAME" or 
#include lt_tr1_functional
         ^
4 errors generated.
*** [curl_get.o] Error code 1

make[4]: stopped in /magus/work/usr/mports/net-p2p/rtorrent/work/rtorrent-0.9.6/src/core
1 error

make[4]: stopped in /magus/work/usr/mports/net-p2p/rtorrent/work/rtorrent-0.9.6/src/core
*** [all-recursive] Error code 1

make[3]: stopped in /magus/work/usr/mports/net-p2p/rtorrent/work/rtorrent-0.9.6/src
1 error

make[3]: stopped in /magus/work/usr/mports/net-p2p/rtorrent/work/rtorrent-0.9.6/src
*** [all-recursive] Error code 1

make[2]: stopped in /magus/work/usr/mports/net-p2p/rtorrent/work/rtorrent-0.9.6
1 error

make[2]: stopped in /magus/work/usr/mports/net-p2p/rtorrent/work/rtorrent-0.9.6
*** [all] Error code 2

make[1]: stopped in /magus/work/usr/mports/net-p2p/rtorrent/work/rtorrent-0.9.6
1 error

make[1]: stopped in /magus/work/usr/mports/net-p2p/rtorrent/work/rtorrent-0.9.6
===> Compilation failed unexpectedly.
Try to set MAKE_JOBS_UNSAFE=yes and rebuild before reporting the failure to
the maintainer.
*** Error code 1

Stop.
make: stopped in /usr/mports/net-p2p/rtorrent

Links

Depends On

Depend Of

Nothing

Categories