MidnightBSD Magus

sysutils/bacula9-client

Network backup solution (client)

Flavor Version Run OSVersion Arch License Restricted Status
9.4.3 400 1.2 amd64 agpl 0 fail

Events

Machine Type Time Message
m1264 info 2020-04-19 00:58:55.781729 Test Started
m1264 fail 2020-04-19 00:59:19.454268 make build returned non-zero: 1
m1264 fail 2020-04-19 00:59:19.560693 Test complete.

Log

===>  Building for bacula9-client-9.4.3
--- all ---
==>Entering directory /magus/work/usr/mports/sysutils/bacula9-client/work/bacula-9.4.3/src
==>Entering directory /magus/work/usr/mports/sysutils/bacula9-client/work/bacula-9.4.3/src/lib
--- attr.lo ---
--- base64.lo ---
--- attr.lo ---
Compiling attr.c
--- base64.lo ---
Compiling base64.c
--- berrno.lo ---
Compiling berrno.c
--- bsys.lo ---
Compiling bsys.c
--- binflate.lo ---
Compiling binflate.c
--- bget_msg.lo ---
Compiling bget_msg.c
--- bnet.lo ---
Compiling bnet.c
--- bnet_server.lo ---
Compiling bnet_server.c
--- bsock.lo ---
Compiling bsock.c
--- bpipe.lo ---
Compiling bpipe.c
--- bsnprintf.lo ---
Compiling bsnprintf.c
--- btime.lo ---
Compiling btime.c
--- cram-md5.lo ---
Compiling cram-md5.c
--- crc32.lo ---
Compiling crc32.c
--- crypto.lo ---
Compiling crypto.c
--- daemon.lo ---
Compiling daemon.c
--- edit.lo ---
Compiling edit.c
--- fnmatch.lo ---
Compiling fnmatch.c
--- guid_to_name.lo ---
Compiling guid_to_name.c
--- hmac.lo ---
Compiling hmac.c
--- jcr.lo ---
Compiling jcr.c
--- lex.lo ---
Compiling lex.c
--- lz4.lo ---
Compiling lz4.c
--- alist.lo ---
Compiling alist.c
--- dlist.lo ---
Compiling dlist.c
--- md5.lo ---
Compiling md5.c
--- message.lo ---
Compiling message.c
--- mem_pool.lo ---
Compiling mem_pool.c
--- openssl.lo ---
Compiling openssl.c
--- plugins.lo ---
Compiling plugins.c
--- priv.lo ---
Compiling priv.c
--- queue.lo ---
Compiling queue.c
--- bregex.lo ---
Compiling bregex.c
--- bsockcore.lo ---
Compiling bsockcore.c
--- runscript.lo ---
Compiling runscript.c
--- rwlock.lo ---
Compiling rwlock.c
--- scan.lo ---
Compiling scan.c
--- sellist.lo ---
Compiling sellist.c
--- serial.lo ---
Compiling serial.c
--- sha1.lo ---
Compiling sha1.c
--- sha2.lo ---
Compiling sha2.c
--- signal.lo ---
Compiling signal.c
--- smartall.lo ---
Compiling smartall.c
--- rblist.lo ---
Compiling rblist.c
--- tls.lo ---
Compiling tls.c
--- tree.lo ---
Compiling tree.c
--- util.lo ---
Compiling util.c
--- var.lo ---
Compiling var.c
--- watchdog.lo ---
Compiling watchdog.c
--- workq.lo ---
Compiling workq.c
--- btimers.lo ---
Compiling btimers.c
--- worker.lo ---
Compiling worker.c
--- flist.lo ---
Compiling flist.c
--- address_conf.lo ---
Compiling address_conf.c
--- breg.lo ---
Compiling breg.c
--- htable.lo ---
Compiling htable.c
--- lockmgr.lo ---
Compiling lockmgr.c
--- devlock.lo ---
Compiling devlock.c
--- output.lo ---
Compiling output.c
--- bwlimit.lo ---
Compiling bwlimit.c
--- ini.lo ---
Compiling ini.c
--- parse_conf.lo ---
Compiling parse_conf.c
--- res.lo ---
Compiling res.c
--- bjson.lo ---
Compiling bjson.c
--- libbac.la ---
Making libbac.la ...
/magus/work/usr/mports/sysutils/bacula9-client/work/bacula-9.4.3/libtool --silent --tag=CXX --mode=link /usr/bin/c++   -L/usr/local/lib -o libbac.la attr.lo base64.lo berrno.lo bsys.lo binflate.lo bget_msg.lo bnet.lo bnet_server.lo bsock.lo bpipe.lo bsnprintf.lo btime.lo cram-md5.lo crc32.lo crypto.lo daemon.lo edit.lo fnmatch.lo guid_to_name.lo hmac.lo jcr.lo lex.lo lz4.lo alist.lo dlist.lo md5.lo message.lo mem_pool.lo openssl.lo plugins.lo priv.lo queue.lo bregex.lo bsockcore.lo runscript.lo rwlock.lo scan.lo sellist.lo serial.lo sha1.lo sha2.lo signal.lo smartall.lo rblist.lo tls.lo tree.lo util.lo var.lo watchdog.lo workq.lo btimers.lo worker.lo flist.lo address_conf.lo breg.lo htable.lo lockmgr.lo devlock.lo output.lo bwlimit.lo -export-dynamic -rpath /usr/local/lib -release 9.4.3 -lwrap  -lz -lssl -lcrypto -lpthread  -lintl 
--- libbaccfg.la ---
Making libbaccfg.la ...
/magus/work/usr/mports/sysutils/bacula9-client/work/bacula-9.4.3/libtool --silent --tag=CXX --mode=link /usr/bin/c++   -L/usr/local/lib -o libbaccfg.la ini.lo parse_conf.lo res.lo bjson.lo -export-dynamic -rpath /usr/local/lib -release 9.4.3 -lssl -lcrypto -lpthread  -lintl
--- all ---
==== Make of lib is good ====
==>Entering directory /magus/work/usr/mports/sysutils/bacula9-client/work/bacula-9.4.3/src/findlib
--- find.lo ---
--- match.lo ---
--- find.lo ---
Compiling find.c
--- match.lo ---
Compiling match.c
--- find_one.lo ---
Compiling find_one.c
--- attribs.lo ---
Compiling attribs.c
--- create_file.lo ---
Compiling create_file.c
--- bfile.lo ---
Compiling bfile.c
--- drivetype.lo ---
Compiling drivetype.c
--- enable_priv.lo ---
Compiling enable_priv.c
--- fstype.lo ---
Compiling fstype.c
--- mkpath.lo ---
Compiling mkpath.c
--- fstype.lo ---
fstype.c:436:18: error: use of undeclared identifier 'getmntinfo'
   if ((nument = getmntinfo(&mntinfo, flags)) > 0) {
                 ^
fstype.c:438:31: error: member access into incomplete type 'struct statfs'
         if (is_rootfs(mntinfo->f_fstypename)) {
                              ^
fstype.c:47:40: note: expanded from macro 'is_rootfs'
#define is_rootfs(x) bstrcmp("rootfs", x)
                                       ^
fstype.c:431:11: note: forward declaration of 'statfs'
   struct statfs *mntinfo;
          ^
fstype.c:441:26: error: member access into incomplete type 'struct statfs'
         if (stat(mntinfo->f_mntonname, &st) < 0) {
                         ^
fstype.c:431:11: note: forward declaration of 'statfs'
   struct statfs *mntinfo;
          ^
fstype.c:444:45: error: member access into incomplete type 'struct statfs'
         mtab_handler(user_ctx, &st, mntinfo->f_mntfromname,
                                            ^
fstype.c:431:11: note: forward declaration of 'statfs'
   struct statfs *mntinfo;
          ^
fstype.c:446:17: error: arithmetic on a pointer to an incomplete type 'struct statfs'
         mntinfo++;
         ~~~~~~~^
fstype.c:431:11: note: forward declaration of 'statfs'
   struct statfs *mntinfo;
          ^
5 errors generated.
*** [fstype.lo] Error code 1

make[2]: stopped in /magus/work/usr/mports/sysutils/bacula9-client/work/bacula-9.4.3/src/findlib
1 error

make[2]: stopped in /magus/work/usr/mports/sysutils/bacula9-client/work/bacula-9.4.3/src/findlib
  ====== Error in /magus/work/usr/mports/sysutils/bacula9-client/work/bacula-9.4.3/src/findlib ======

*** [all] Error code 1

make[1]: stopped in /magus/work/usr/mports/sysutils/bacula9-client/work/bacula-9.4.3
1 error

make[1]: stopped in /magus/work/usr/mports/sysutils/bacula9-client/work/bacula-9.4.3
===> Compilation failed unexpectedly.
Try to set MAKE_JOBS_UNSAFE=yes and rebuild before reporting the failure to
the maintainer.
*** Error code 1

Stop.
make: stopped in /usr/mports/sysutils/bacula9-client