MidnightBSD Magus


MIME and Application database for GNOME

Flavor Version Run OSVersion Arch License Restricted Status
2.18.0_4 279 0.5 i386 gpl2 0 fail


Machine Type Time Message
Constellation info 2014-09-23 09:21:13.802896 Test Started
Constellation fail 2014-09-23 09:22:17.289198 make build returned non-zero: 1
Constellation fail 2014-09-23 09:22:17.371077 Test complete.


===>  Building for gnome-mime-data-2.18.0_4
gmake  all-recursive
gmake[1]: Entering directory `/magus/work/usr/mports/misc/gnome-mime-data/work/gnome-mime-data-2.18.0'
Making all in man
gmake[2]: Entering directory `/magus/work/usr/mports/misc/gnome-mime-data/work/gnome-mime-data-2.18.0/man'
gmake[2]: Nothing to be done for `all'.
gmake[2]: Leaving directory `/magus/work/usr/mports/misc/gnome-mime-data/work/gnome-mime-data-2.18.0/man'
Making all in po
gmake[2]: Entering directory `/magus/work/usr/mports/misc/gnome-mime-data/work/gnome-mime-data-2.18.0/po'
file=`echo af | sed 's,.*/,,'`.gmo \
  && rm -f $file &&  -o $file af.po
file=`echo am | sed 's,.*/,,'`.gmo \
  && rm -f $file &&  -o $file am.po
-o: not found
-o: not found
gmake[2]: *** [af.gmo] Error 127
gmake[2]: *** Waiting for unfinished jobs....
gmake[2]: *** [am.gmo] Error 127
gmake[2]: Leaving directory `/magus/work/usr/mports/misc/gnome-mime-data/work/gnome-mime-data-2.18.0/po'
gmake[1]: *** [all-recursive] Error 1
gmake[1]: Leaving directory `/magus/work/usr/mports/misc/gnome-mime-data/work/gnome-mime-data-2.18.0'
gmake: *** [all] Error 2
*** [run-build] Error code 2

Stop in /usr/mports/misc/gnome-mime-data.