MidnightBSD Magus

x11-themes/gnome-backgrounds

Collection of backgrounds for GNOME 2

Flavor Version Run OSVersion Arch License Restricted Status
2.32.0_1 281 0.6 amd64 ARRAY(0x804c3e360) 0 fail

Events

Machine Type Time Message
defiant info 2014-11-10 06:54:14.721236 Test Started
defiant fail 2014-11-10 06:54:59.242497 make build returned non-zero: 1
defiant fail 2014-11-10 06:54:59.406958 Test complete.

Log

===>  Building for gnome-backgrounds-2.32.0_1
Making all in abstract
gmake[1]: Entering directory '/magus/work/usr/mports/x11-themes/gnome-backgrounds/work/gnome-backgrounds-2.32.0/abstract'
  GEN    gnome-abstract.xml.in
LC_ALL=C /usr/local/bin/intltool-merge -x -u -c ../po/.intltool-merge-cache ../po gnome-abstract.xml.in gnome-abstract.xml
Generating and caching the translation database
Merging translations into gnome-abstract.xml.
CREATED gnome-abstract.xml
gmake[1]: Leaving directory '/magus/work/usr/mports/x11-themes/gnome-backgrounds/work/gnome-backgrounds-2.32.0/abstract'
Making all in nature
gmake[1]: Entering directory '/magus/work/usr/mports/x11-themes/gnome-backgrounds/work/gnome-backgrounds-2.32.0/nature'
  GEN    gnome-nature.xml.in
LC_ALL=C /usr/local/bin/intltool-merge -x -u -c ../po/.intltool-merge-cache ../po gnome-nature.xml.in gnome-nature.xml
Found cached translation database
Merging translations into gnome-nature.xml.
CREATED gnome-nature.xml
gmake[1]: Leaving directory '/magus/work/usr/mports/x11-themes/gnome-backgrounds/work/gnome-backgrounds-2.32.0/nature'
Making all in po
gmake[1]: Entering directory '/magus/work/usr/mports/x11-themes/gnome-backgrounds/work/gnome-backgrounds-2.32.0/po'
file=`echo af | sed 's,.*/,,'`.gmo \
  && rm -f $file && /usr/local/bin/msgfmt -o $file af.po
file=`echo an | sed 's,.*/,,'`.gmo \
  && rm -f $file && /usr/local/bin/msgfmt -o $file an.po
file=`echo ar | sed 's,.*/,,'`.gmo \
  && rm -f $file && /usr/local/bin/msgfmt -o $file ar.po
file=`echo as | sed 's,.*/,,'`.gmo \
  && rm -f $file && /usr/local/bin/msgfmt -o $file as.po
file=`echo ast | sed 's,.*/,,'`.gmo \
  && rm -f $file && /usr/local/bin/msgfmt -o $file ast.po
file=`echo be | sed 's,.*/,,'`.gmo \
  && rm -f $file && /usr/local/bin/msgfmt -o $file be.po
file=`echo be@latin | sed 's,.*/,,'`.gmo \
  && rm -f $file && /usr/local/bin/msgfmt -o $file be@latin.po
file=`echo bg | sed 's,.*/,,'`.gmo \
  && rm -f $file && /usr/local/bin/msgfmt -o $file bg.po
ar.po:27:9: invalid multibyte sequence
ar.po:27:10: invalid multibyte sequence
ar.po:27:11: invalid multibyte sequence
ar.po:27:12: invalid multibyte sequence
ar.po:27:13: invalid multibyte sequence
af.po:76:11: invalid multibyte sequencear.po:27:14: invalid multibyte sequence

ar.po:27:15: invalid multibyte sequence
af.po:76:12: invalid multibyte sequencear.po:27:16: invalid multibyte sequence

ar.po:31:9: invalid multibyte sequence
ar.po:31:10: invalid multibyte sequence
ar.po:31:11: invalid multibyte sequence
as.po:23:9: invalid multibyte sequencear.po:31:12: invalid multibyte sequence

/usr/local/bin/msgfmt: ar.po:31:13: invalid multibyte sequencefound 2 fatal errors

ar.po:31:14: invalid multibyte sequenceas.po:23:10: invalid multibyte sequence

ar.po:35:9: invalid multibyte sequence
as.po:23:11: invalid multibyte sequencear.po:35:10: invalid multibyte sequence

as.po:23:12: invalid multibyte sequence
ar.po:35:11: invalid multibyte sequenceMakefile:85: recipe for target 'af.gmo' failed
as.po:23:13: invalid multibyte sequence
gmake[1]: *** [af.gmo] Error 1

ar.po:35:12: invalid multibyte sequence
ar.po:35:13: invalid multibyte sequence
as.po:23:14: invalid multibyte sequencear.po:35:14: invalid multibyte sequence

/usr/local/bin/msgfmt: as.po:23:15: invalid multibyte sequence
too many errors, abortingas.po:23:16: invalid multibyte sequence

as.po:23:17: invalid multibyte sequence
as.po:23:18: invalid multibyte sequencegmake[1]: *** Waiting for unfinished jobs....

as.po:23:19: invalid multibyte sequence
as.po:23:20: invalid multibyte sequence
as.po:23:21: invalid multibyte sequence
Makefile:85: recipe for target 'ar.gmo' failed
as.po:23:22: invalid multibyte sequencegmake[1]: *** [ar.gmo] Error 1

as.po:23:23: invalid multibyte sequence
as.po:23:24: invalid multibyte sequence
as.po:23:25: invalid multibyte sequence
as.po:23:26: invalid multibyte sequence
as.po:27:9: invalid multibyte sequence
as.po:27:10: invalid multibyte sequence
/usr/local/bin/msgfmt: too many errors, aborting
Makefile:85: recipe for target 'as.gmo' failed
gmake[1]: *** [as.gmo] Error 1
be.po:24:9: invalid multibyte sequence
be.po:24:10: invalid multibyte sequence
be.po:24:11: invalid multibyte sequence
be.po:24:12: invalid multibyte sequence
be.po:24:13: invalid multibyte sequence
be.po:24:14: invalid multibyte sequence
be.po:24:15: invalid multibyte sequence
be.po:24:16: invalid multibyte sequence
be.po:24:17: invalid multibyte sequence
be.po:24:18: invalid multibyte sequence
be.po:30:9: invalid multibyte sequence
be.po:30:10: invalid multibyte sequence
be.po:30:11: invalid multibyte sequence
be.po:30:12: invalid multibyte sequence
be.po:30:13: invalid multibyte sequence
be.po:30:14: invalid multibyte sequence
be.po:30:15: invalid multibyte sequence
be.po:30:16: invalid multibyte sequence
be.po:30:17: invalid multibyte sequence
be.po:30:18: invalid multibyte sequence
/usr/local/bin/msgfmt: too many errors, aborting
Makefile:85: recipe for target 'be.gmo' failed
gmake[1]: *** [be.gmo] Error 1
an.po:59:14: invalid multibyte sequence
an.po:59:15: invalid multibyte sequence
/usr/local/bin/msgfmt: found 2 fatal errors
Makefile:85: recipe for target 'an.gmo' failed
gmake[1]: *** [an.gmo] Error 1
be@latin.po:18:10: invalid multibyte sequence
be@latin.po:18:11: invalid multibyte sequence
be@latin.po:18:13: invalid multibyte sequence
be@latin.po:18:14: invalid multibyte sequence
be@latin.po:22:10: invalid multibyte sequence
be@latin.po:22:11: invalid multibyte sequence
be@latin.po:52:9: invalid multibyte sequence
be@latin.po:52:10: invalid multibyte sequence
be@latin.po:52:14: invalid multibyte sequence
be@latin.po:52:15: invalid multibyte sequence
be@latin.po:56:13: invalid multibyte sequence
bg.po:23:9: invalid multibyte sequencebe@latin.po:56:14: invalid multibyte sequence

bg.po:23:10: invalid multibyte sequence
bg.po:23:11: invalid multibyte sequencebe@latin.po:62:17: invalid multibyte sequence

be@latin.po:62:18: invalid multibyte sequencebg.po:23:12: invalid multibyte sequence

be@latin.po:66:12: invalid multibyte sequence
bg.po:23:13: invalid multibyte sequencebe@latin.po:66:13: invalid multibyte sequence

bg.po:23:14: invalid multibyte sequencebe@latin.po:66:15: invalid multibyte sequence

bg.po:23:15: invalid multibyte sequencebe@latin.po:66:16: invalid multibyte sequence

bg.po:23:16: invalid multibyte sequence
be@latin.po:70:18: invalid multibyte sequencebg.po:23:17: invalid multibyte sequence

ast.po:65:13: invalid multibyte sequencebe@latin.po:70:19: invalid multibyte sequencebg.po:23:18: invalid multibyte sequence


ast.po:65:14: invalid multibyte sequence/usr/local/bin/msgfmt: bg.po:23:19: invalid multibyte sequence
too many errors, aborting

bg.po:23:20: invalid multibyte sequenceast.po:75:14: invalid multibyte sequence

bg.po:23:21: invalid multibyte sequenceast.po:75:15: invalid multibyte sequence

bg.po:23:22: invalid multibyte sequence
bg.po:23:24: invalid multibyte sequence
Makefile:85: recipe for target 'be@latin.gmo' failed
bg.po:23:25: invalid multibyte sequence/usr/local/bin/msgfmt: gmake[1]: *** [be@latin.gmo] Error 1

found 4 fatal errorsbg.po:23:26: invalid multibyte sequence

bg.po:23:27: invalid multibyte sequence
bg.po:23:28: invalid multibyte sequence
bg.po:23:29: invalid multibyte sequence
/usr/local/bin/msgfmt: too many errors, aborting
Makefile:85: recipe for target 'ast.gmo' failed
gmake[1]: *** [ast.gmo] Error 1
Makefile:85: recipe for target 'bg.gmo' failed
gmake[1]: *** [bg.gmo] Error 1
gmake[1]: Leaving directory '/magus/work/usr/mports/x11-themes/gnome-backgrounds/work/gnome-backgrounds-2.32.0/po'
Makefile:284: recipe for target 'all-recursive' failed
gmake: *** [all-recursive] Error 1
*** [run-build] Error code 2

Stop in /usr/mports/x11-themes/gnome-backgrounds.