MidnightBSD Magus

misc/getopt

getopt(1) replacement that supports GNU-style long options

Flavor Version Run OSVersion Arch License Restricted Status
1.1.6 284 0.6 amd64 gpl2 gpl3 0 fail

Events

Machine Type Time Message
defiant info 2014-12-21 14:19:53.764025 Test Started
defiant fail 2014-12-21 14:20:36.790065 make build returned non-zero: 1
defiant fail 2014-12-21 14:20:36.88444 Test complete.

Log

===>  Building for getopt-1.1.6
gcc -c  -DLIBCGETOPT=1 -DWITHOUT_GETTEXT=0 -DLOCALEDIR=\"/usr/local/share/locale\" -DNOT_UTIL_LINUX -Dprogram_invocation_short_name=\"getopt\"  -Dprogram_version=\"1.1.6\" -O2 -pipe -I/usr/local/include -I/usr/local/include -fno-strict-aliasing getopt.c -o getopt.o
msgfmt -o po/ca.mo po/ca.po
msgfmt -o po/cs.mo po/cs.po
msgfmt -o po/da.mo po/da.po
msgfmt -o po/de.mo po/de.po
msgfmt -o po/es.mo po/es.po
msgfmt -o po/et.mo po/et.po
msgfmt -o po/eu.mo po/eu.po
po/cs.po:55:10: invalid multibyte sequence
po/da.po:79:14: invalid multibyte sequencepo/cs.po:55:11: invalid multibyte sequence
po/cs.po:55:23: invalid multibyte sequence
po/cs.po:55:24: invalid multibyte sequence
po/cs.po:55:27: invalid multibyte sequence
po/cs.po:55:28: invalid multibyte sequence
po/cs.po:55:31: invalid multibyte sequence
po/cs.po:55:32: invalid multibyte sequence
po/cs.po:55:37: invalid multibyte sequence
po/cs.po:55:38: invalid multibyte sequence
po/cs.po:55:39: invalid multibyte sequence
po/cs.po:55:40: invalid multibyte sequence
po/cs.po:55:47: invalid multibyte sequence
po/cs.po:55:48: invalid multibyte sequence
po/cs.po:55:49: invalid multibyte sequence
po/de.po:68:23: invalid multibyte sequencepo/ca.po:28:47: invalid multibyte sequence
po/cs.po:55:59: invalid multibyte sequence
po/de.po:68:24: invalid multibyte sequence

po/da.po:79:15: invalid multibyte sequencepo/de.po:68:34: invalid multibyte sequencepo/cs.po:55:60: invalid multibyte sequence


po/de.po:68:35: invalid multibyte sequencepo/cs.po:55:61: invalid multibyte sequence

po/da.po:79:25: invalid multibyte sequencepo/es.po:33:47: invalid multibyte sequencepo/de.po:68:38: invalid multibyte sequence
po/cs.po:59:11: invalid multibyte sequence

po/da.po:79:26: invalid multibyte sequence
po/es.po:33:48: invalid multibyte sequencepo/de.po:68:39: invalid multibyte sequence
po/cs.po:59:12: invalid multibyte sequence

po/es.po:33:60: invalid multibyte sequencepo/da.po:90:20: invalid multibyte sequence


po/es.po:33:61: invalid multibyte sequencepo/da.po:90:21: invalid multibyte sequence
msgfmt: 
po/de.po:94:47: invalid multibyte sequencetoo many errors, aborting
po/es.po:37:13: invalid multibyte sequence

po/de.po:94:48: invalid multibyte sequencepo/ca.po:28:48: invalid multibyte sequence


po/es.po:37:14: invalid multibyte sequencepo/ca.po:28:60: invalid multibyte sequence

po/es.po:37:26: invalid multibyte sequencepo/da.po:136:65: invalid multibyte sequencepo/ca.po:28:61: invalid multibyte sequence

po/de.po:114:68: invalid multibyte sequence
Makefile:95: recipe for target 'po/cs.mo' failed
po/da.po:136:66: invalid multibyte sequence
po/es.po:37:27: invalid multibyte sequencegmake: *** [po/cs.mo] Error 1
po/ca.po:32:13: invalid multibyte sequence
po/de.po:114:69: invalid multibyte sequencegmake: *** Waiting for unfinished jobs....



po/da.po:144:55: invalid multibyte sequencepo/ca.po:32:14: invalid multibyte sequence

po/de.po:122:53: invalid multibyte sequencepo/da.po:144:56: invalid multibyte sequencepo/ca.po:32:34: invalid multibyte sequence


po/de.po:122:54: invalid multibyte sequencepo/ca.po:32:35: invalid multibyte sequence

po/da.po:152:38: invalid multibyte sequence
po/es.po:81:52: invalid multibyte sequencepo/ca.po:36:12: invalid multibyte sequencepo/da.po:152:39: invalid multibyte sequence


po/es.po:81:53: invalid multibyte sequencepo/ca.po:36:13: invalid multibyte sequence
po/de.po:175:3: invalid multibyte sequence

po/ca.po:36:45: invalid multibyte sequence
po/de.po:175:4: invalid multibyte sequencepo/da.po:176:37: invalid multibyte sequencepo/es.po:93:19: invalid multibyte sequencepo/ca.po:36:46: invalid multibyte sequence



po/da.po:176:38: invalid multibyte sequence
po/es.po:93:20: invalid multibyte sequence
po/es.po:93:25: invalid multibyte sequence
po/ca.po:51:64: invalid multibyte sequencepo/es.po:93:26: invalid multibyte sequence
po/de.po:215:18: invalid multibyte sequence
po/ca.po:51:65: invalid multibyte sequence

po/es.po:94:5: invalid multibyte sequencepo/de.po:215:19: invalid multibyte sequencepo/ca.po:56:65: invalid multibyte sequence


po/es.po:94:6: invalid multibyte sequencepo/ca.po:56:66: invalid multibyte sequence

msgfmt: found 14 fatal errors
po/es.po:99:60: invalid multibyte sequencemsgfmt: po/ca.po:68:62: invalid multibyte sequence
found 16 fatal errors
po/es.po:99:61: invalid multibyte sequence
po/ca.po:68:63: invalid multibyte sequence

Makefile:95: recipe for target 'po/da.mo' failed
gmake: *** [po/da.mo] Error 1
po/ca.po:74:71: invalid multibyte sequence
Makefile:95: recipe for target 'po/de.mo' failed
po/ca.po:74:72: invalid multibyte sequencegmake: *** [po/de.mo] Error 1
po/es.po:139:57: invalid multibyte sequence

msgfmt: too many errors, aborting
po/es.po:139:58: invalid multibyte sequence
msgfmt: too many errors, aborting
Makefile:95: recipe for target 'po/ca.mo' failed
gmake: *** [po/ca.mo] Error 1
Makefile:95: recipe for target 'po/es.mo' failed
gmake: *** [po/es.mo] Error 1
*** [run-build] Error code 2

Stop in /usr/mports/misc/getopt.