MidnightBSD Magus

misc/gnome-mime-data

MIME and Application database for GNOME

Flavor Version Run OSVersion Arch License Restricted Status
2.18.0_4 289 0.6 amd64 gpl2 0 fail

Events

Machine Type Time Message
defiant info 2015-03-28 18:26:05.637273 Test Started
defiant fail 2015-03-28 18:26:51.677885 make build returned non-zero: 1
defiant fail 2015-03-28 18:26:51.829332 Test complete.

Log

===>  Building for gnome-mime-data-2.18.0_4
gmake  all-recursive
gmake[1]: Entering directory '/magus/work/usr/mports/misc/gnome-mime-data/work/gnome-mime-data-2.18.0'
Making all in man
gmake[2]: Entering directory '/magus/work/usr/mports/misc/gnome-mime-data/work/gnome-mime-data-2.18.0/man'
gmake[2]: Nothing to be done for 'all'.
gmake[2]: Leaving directory '/magus/work/usr/mports/misc/gnome-mime-data/work/gnome-mime-data-2.18.0/man'
Making all in po
gmake[2]: Entering directory '/magus/work/usr/mports/misc/gnome-mime-data/work/gnome-mime-data-2.18.0/po'
file=`echo af | sed 's,.*/,,'`.gmo \
  && rm -f $file &&  -o $file af.po
file=`echo am | sed 's,.*/,,'`.gmo \
  && rm -f $file &&  -o $file am.po
file=`echo ar | sed 's,.*/,,'`.gmo \
  && rm -f $file &&  -o $file ar.po
file=`echo az | sed 's,.*/,,'`.gmo \
  && rm -f $file &&  -o $file az.po
file=`echo be | sed 's,.*/,,'`.gmo \
  && rm -f $file &&  -o $file be.po
file=`echo bg | sed 's,.*/,,'`.gmo \
  && rm -f $file &&  -o $file bg.po
file=`echo bn | sed 's,.*/,,'`.gmo \
  && rm -f $file &&  -o $file bn.po
file=`echo bs | sed 's,.*/,,'`.gmo \
  && rm -f $file &&  -o $file bs.po
-o: not found
Makefile:81: recipe for target 'am.gmo' failed
gmake[2]: *** [am.gmo] Error 127
gmake[2]: *** Waiting for unfinished jobs....
-o: not found
-o: not found
Makefile:81: recipe for target 'ar.gmo' failed
gmake[2]: *** [ar.gmo] Error 127
Makefile:81: recipe for target 'af.gmo' failed
gmake[2]: *** [af.gmo] Error 127
-o: not found
Makefile:81: recipe for target 'az.gmo' failed
gmake[2]: *** [az.gmo] Error 127
-o: not found
Makefile:81: recipe for target 'be.gmo' failed
gmake[2]: *** [be.gmo] Error 127
-o: not found
Makefile:81: recipe for target 'bg.gmo' failed
gmake[2]: *** [bg.gmo] Error 127
-o: not found
Makefile:81: recipe for target 'bs.gmo' failed
gmake[2]: *** [bs.gmo] Error 127
-o: not found
Makefile:81: recipe for target 'bn.gmo' failed
gmake[2]: *** [bn.gmo] Error 127
gmake[2]: Leaving directory '/magus/work/usr/mports/misc/gnome-mime-data/work/gnome-mime-data-2.18.0/po'
Makefile:394: recipe for target 'all-recursive' failed
gmake[1]: *** [all-recursive] Error 1
gmake[1]: Leaving directory '/magus/work/usr/mports/misc/gnome-mime-data/work/gnome-mime-data-2.18.0'
Makefile:259: recipe for target 'all' failed
gmake: *** [all] Error 2
*** [run-build] Error code 2

Stop in /usr/mports/misc/gnome-mime-data.