MidnightBSD Magus

sysutils/hal

Hardware Abstraction Layer for simplifying device access

Flavor Version Run OSVersion Arch License Restricted Status
0.5.14_9 308 0.7 amd64 gpl2 0 fail

Events

Machine Type Time Message
defiant info 2015-08-21 16:12:16.226823 Test Started
defiant fail 2015-08-21 16:19:23.459133 make build returned non-zero: 1
defiant fail 2015-08-21 16:19:23.586179 Test complete.

Log

===>  Building for hal-0.5.14_9
gmake  all-recursive
gmake[1]: Entering directory '/magus/work/usr/mports/sysutils/hal/work/hal-0.5.14'
Making all in libhal
gmake[2]: Entering directory '/magus/work/usr/mports/sysutils/hal/work/hal-0.5.14/libhal'
  CC     libhal.lo
  CCLD   libhal.la
gmake[2]: Leaving directory '/magus/work/usr/mports/sysutils/hal/work/hal-0.5.14/libhal'
Making all in libhal-storage
gmake[2]: Entering directory '/magus/work/usr/mports/sysutils/hal/work/hal-0.5.14/libhal-storage'
  CC     libhal-storage.lo
libhal-storage.c: In function 'libhal_storage_policy_set_icon_mapping':
libhal-storage.c:132: warning: 'libhal_storage_policy_set_icon_path' is deprecated (declared at libhal-storage.c:102)
libhal-storage.c: In function 'libhal_drive_policy_compute_display_name':
libhal-storage.c:217: warning: 'libhal_volume_policy_compute_size_as_string' is deprecated (declared at libhal-storage.c:158)
libhal-storage.c: In function 'libhal_volume_policy_compute_display_name':
libhal-storage.c:365: warning: 'libhal_volume_policy_compute_size_as_string' is deprecated (declared at libhal-storage.c:158)
libhal-storage.c: In function 'libhal_drive_policy_compute_icon_name':
libhal-storage.c:544: warning: 'libhal_storage_policy_lookup_icon' is deprecated (declared at libhal-storage.c:138)
libhal-storage.c:548: warning: 'libhal_storage_policy_lookup_icon' is deprecated (declared at libhal-storage.c:138)
libhal-storage.c: In function 'libhal_volume_policy_compute_icon_name':
libhal-storage.c:569: warning: 'libhal_storage_policy_lookup_icon' is deprecated (declared at libhal-storage.c:138)
libhal-storage.c:574: warning: 'libhal_storage_policy_lookup_icon' is deprecated (declared at libhal-storage.c:138)
libhal-storage.c:587: warning: 'libhal_storage_policy_lookup_icon' is deprecated (declared at libhal-storage.c:138)
libhal-storage.c:591: warning: 'libhal_storage_policy_lookup_icon' is deprecated (declared at libhal-storage.c:138)
  CCLD   libhal-storage.la
gmake[2]: Leaving directory '/magus/work/usr/mports/sysutils/hal/work/hal-0.5.14/libhal-storage'
Making all in partutil
gmake[2]: Entering directory '/magus/work/usr/mports/sysutils/hal/work/hal-0.5.14/partutil'
gmake[2]: Nothing to be done for 'all'.
gmake[2]: Leaving directory '/magus/work/usr/mports/sysutils/hal/work/hal-0.5.14/partutil'
Making all in hald
gmake[2]: Entering directory '/magus/work/usr/mports/sysutils/hal/work/hal-0.5.14/hald'
gmake  all-recursive
gmake[3]: Entering directory '/magus/work/usr/mports/sysutils/hal/work/hal-0.5.14/hald'
Making all in dummy
gmake[4]: Entering directory '/magus/work/usr/mports/sysutils/hal/work/hal-0.5.14/hald/dummy'
  CC     osspec.lo
  CCLD   libhald_dummy.la
gmake[4]: Leaving directory '/magus/work/usr/mports/sysutils/hal/work/hal-0.5.14/hald/dummy'
Making all in freebsd
gmake[4]: Entering directory '/magus/work/usr/mports/sysutils/hal/work/hal-0.5.14/hald/freebsd'
Making all in libprobe
gmake[5]: Entering directory '/magus/work/usr/mports/sysutils/hal/work/hal-0.5.14/hald/freebsd/libprobe'
  CC     hfp.lo
  CC     hfp-cdrom.lo
  CCLD   libhald_freebsd_probe.la
gmake[5]: Leaving directory '/magus/work/usr/mports/sysutils/hal/work/hal-0.5.14/hald/freebsd/libprobe'
Making all in probing
gmake[5]: Entering directory '/magus/work/usr/mports/sysutils/hal/work/hal-0.5.14/hald/freebsd/probing'
cc -DHAVE_CONFIG_H -I. -I../../..  -DPACKAGE_SYSCONF_DIR=\""/usr/local/etc"\" -DPACKAGE_DATA_DIR=\""/usr/local/share"\" -DPACKAGE_BIN_DIR=\""/usr/local/bin"\" -DPACKAGE_LOCALE_DIR=\""/usr/local/share/locale"\" -DPACKAGE_LOCALSTATEDIR=\""/var"\" -I../../.. -I/usr/local/include/dbus-1.0 -I/usr/local/include/dbus-1.0/include   -I/usr/local/include  -O2 -pipe -fno-strict-aliasing -Wall -Wchar-subscripts -Wmissing-declarations -Wnested-externs -Wpointer-arith -Wcast-align -Wsign-compare -MT probe-hiddev.o -MD -MP -MF .deps/probe-hiddev.Tpo -c -o probe-hiddev.o probe-hiddev.c
cc -DHAVE_CONFIG_H -I. -I../../..  -DPACKAGE_SYSCONF_DIR=\""/usr/local/etc"\" -DPACKAGE_DATA_DIR=\""/usr/local/share"\" -DPACKAGE_BIN_DIR=\""/usr/local/bin"\" -DPACKAGE_LOCALE_DIR=\""/usr/local/share/locale"\" -DPACKAGE_LOCALSTATEDIR=\""/var"\" -I../../.. -I/usr/local/include/dbus-1.0 -I/usr/local/include/dbus-1.0/include   -I/usr/local/include/glib-2.0 -I/usr/local/lib/glib-2.0/include -I/usr/local/include -I/usr/local/include/dbus-1.0 -I/usr/local/include/dbus-1.0/include   -I/usr/local/include  -O2 -pipe -fno-strict-aliasing -Wall -Wchar-subscripts -Wmissing-declarations -Wnested-externs -Wpointer-arith -Wcast-align -Wsign-compare -MT hald_probe_mouse-probe-mouse.o -MD -MP -MF .deps/hald_probe_mouse-probe-mouse.Tpo -c -o hald_probe_mouse-probe-mouse.o `test -f 'probe-mouse.c' || echo './'`probe-mouse.c
cc -DHAVE_CONFIG_H -I. -I../../..  -DPACKAGE_SYSCONF_DIR=\""/usr/local/etc"\" -DPACKAGE_DATA_DIR=\""/usr/local/share"\" -DPACKAGE_BIN_DIR=\""/usr/local/bin"\" -DPACKAGE_LOCALE_DIR=\""/usr/local/share/locale"\" -DPACKAGE_LOCALSTATEDIR=\""/var"\" -I../../.. -I/usr/local/include/dbus-1.0 -I/usr/local/include/dbus-1.0/include   -I/usr/local/include  -O2 -pipe -fno-strict-aliasing -Wall -Wchar-subscripts -Wmissing-declarations -Wnested-externs -Wpointer-arith -Wcast-align -Wsign-compare -MT probe-scsi.o -MD -MP -MF .deps/probe-scsi.Tpo -c -o probe-scsi.o probe-scsi.c
cc -DHAVE_CONFIG_H -I. -I../../..  -DPACKAGE_SYSCONF_DIR=\""/usr/local/etc"\" -DPACKAGE_DATA_DIR=\""/usr/local/share"\" -DPACKAGE_BIN_DIR=\""/usr/local/bin"\" -DPACKAGE_LOCALE_DIR=\""/usr/local/share/locale"\" -DPACKAGE_LOCALSTATEDIR=\""/var"\" -I../../.. -I/usr/local/include/dbus-1.0 -I/usr/local/include/dbus-1.0/include   -I/usr/local/include  -O2 -pipe -fno-strict-aliasing -Wall -Wchar-subscripts -Wmissing-declarations -Wnested-externs -Wpointer-arith -Wcast-align -Wsign-compare -MT probe-smbios.o -MD -MP -MF .deps/probe-smbios.Tpo -c -o probe-smbios.o probe-smbios.c
cc -DHAVE_CONFIG_H -I. -I../../..  -DPACKAGE_SYSCONF_DIR=\""/usr/local/etc"\" -DPACKAGE_DATA_DIR=\""/usr/local/share"\" -DPACKAGE_BIN_DIR=\""/usr/local/bin"\" -DPACKAGE_LOCALE_DIR=\""/usr/local/share/locale"\" -DPACKAGE_LOCALSTATEDIR=\""/var"\" -I../../.. -I/usr/local/include/dbus-1.0 -I/usr/local/include/dbus-1.0/include   -I/usr/local/include/glib-2.0 -I/usr/local/lib/glib-2.0/include -I/usr/local/include -I/usr/local/include/dbus-1.0 -I/usr/local/include/dbus-1.0/include   -I/usr/local/include   -I/usr/local/include  -O2 -pipe -fno-strict-aliasing -Wall -Wchar-subscripts -Wmissing-declarations -Wnested-externs -Wpointer-arith -Wcast-align -Wsign-compare -MT hald_probe_storage-freebsd_dvd_rw_utils.o -MD -MP -MF .deps/hald_probe_storage-freebsd_dvd_rw_utils.Tpo -c -o hald_probe_storage-freebsd_dvd_rw_utils.o `test -f 'freebsd_dvd_rw_utils.c' || echo './'`freebsd_dvd_rw_utils.c
cc -DHAVE_CONFIG_H -I. -I../../..  -DPACKAGE_SYSCONF_DIR=\""/usr/local/etc"\" -DPACKAGE_DATA_DIR=\""/usr/local/share"\" -DPACKAGE_BIN_DIR=\""/usr/local/bin"\" -DPACKAGE_LOCALE_DIR=\""/usr/local/share/locale"\" -DPACKAGE_LOCALSTATEDIR=\""/var"\" -I../../.. -I/usr/local/include/dbus-1.0 -I/usr/local/include/dbus-1.0/include   -I/usr/local/include/glib-2.0 -I/usr/local/lib/glib-2.0/include -I/usr/local/include -I/usr/local/include/dbus-1.0 -I/usr/local/include/dbus-1.0/include   -I/usr/local/include   -I/usr/local/include  -O2 -pipe -fno-strict-aliasing -Wall -Wchar-subscripts -Wmissing-declarations -Wnested-externs -Wpointer-arith -Wcast-align -Wsign-compare -MT hald_probe_storage-probe-storage.o -MD -MP -MF .deps/hald_probe_storage-probe-storage.Tpo -c -o hald_probe_storage-probe-storage.o `test -f 'probe-storage.c' || echo './'`probe-storage.c
cc -DHAVE_CONFIG_H -I. -I../../..  -DPACKAGE_SYSCONF_DIR=\""/usr/local/etc"\" -DPACKAGE_DATA_DIR=\""/usr/local/share"\" -DPACKAGE_BIN_DIR=\""/usr/local/bin"\" -DPACKAGE_LOCALE_DIR=\""/usr/local/share/locale"\" -DPACKAGE_LOCALSTATEDIR=\""/var"\" -I../../.. -I/usr/local/include/dbus-1.0 -I/usr/local/include/dbus-1.0/include   -I/usr/local/include/glib-2.0 -I/usr/local/lib/glib-2.0/include -I/usr/local/include -I/usr/local/include/dbus-1.0 -I/usr/local/include/dbus-1.0/include   -I/usr/local/include   -I/usr/local/include  -O2 -pipe -fno-strict-aliasing -Wall -Wchar-subscripts -Wmissing-declarations -Wnested-externs -Wpointer-arith -Wcast-align -Wsign-compare -MT hald_probe_volume-freebsd_dvd_rw_utils.o -MD -MP -MF .deps/hald_probe_volume-freebsd_dvd_rw_utils.Tpo -c -o hald_probe_volume-freebsd_dvd_rw_utils.o `test -f 'freebsd_dvd_rw_utils.c' || echo './'`freebsd_dvd_rw_utils.c
cc -DHAVE_CONFIG_H -I. -I../../..  -DPACKAGE_SYSCONF_DIR=\""/usr/local/etc"\" -DPACKAGE_DATA_DIR=\""/usr/local/share"\" -DPACKAGE_BIN_DIR=\""/usr/local/bin"\" -DPACKAGE_LOCALE_DIR=\""/usr/local/share/locale"\" -DPACKAGE_LOCALSTATEDIR=\""/var"\" -I../../.. -I/usr/local/include/dbus-1.0 -I/usr/local/include/dbus-1.0/include   -I/usr/local/include/glib-2.0 -I/usr/local/lib/glib-2.0/include -I/usr/local/include -I/usr/local/include/dbus-1.0 -I/usr/local/include/dbus-1.0/include   -I/usr/local/include   -I/usr/local/include  -O2 -pipe -fno-strict-aliasing -Wall -Wchar-subscripts -Wmissing-declarations -Wnested-externs -Wpointer-arith -Wcast-align -Wsign-compare -MT hald_probe_volume-probe-volume.o -MD -MP -MF .deps/hald_probe_volume-probe-volume.Tpo -c -o hald_probe_volume-probe-volume.o `test -f 'probe-volume.c' || echo './'`probe-volume.c
probe-hiddev.c: In function 'main':
probe-hiddev.c:81: error: 'USB_GET_REPORT_ID' undeclared (first use in this function)
probe-hiddev.c:81: error: (Each undeclared identifier is reported only once
probe-hiddev.c:81: error: for each function it appears in.)
Makefile:461: recipe for target 'probe-hiddev.o' failed
gmake[5]: *** [probe-hiddev.o] Error 1
gmake[5]: *** Waiting for unfinished jobs....
probe-smbios.c:84: warning: 'copykeyval' defined but not used
probe-scsi.c: In function 'main':
probe-scsi.c:61: warning: pointer targets in passing argument 1 of 'hfp_strndup' differ in signedness
mv -f .deps/probe-scsi.Tpo .deps/probe-scsi.Po
freebsd_dvd_rw_utils.c: In function 'scsi_command_init':
freebsd_dvd_rw_utils.c:55: warning: comparison between signed and unsigned
freebsd_dvd_rw_utils.c: In function 'scsi_command_init':
freebsd_dvd_rw_utils.c:55: warning: comparison between signed and unsigned
mv -f .deps/probe-smbios.Tpo .deps/probe-smbios.Po
probe-volume.c: In function 'hf_probe_volume_advanced_disc_detect':
probe-volume.c:187: warning: pointer targets in passing argument 1 of 'isonum_711' differ in signedness
probe-volume.c:191: warning: pointer targets in passing argument 1 of 'isonum_711' differ in signedness
probe-volume.c:193: warning: pointer targets in passing argument 1 of 'isonum_733' differ in signedness
probe-volume.c:195: warning: pointer targets in passing argument 1 of 'isonum_731' differ in signedness
mv -f .deps/hald_probe_mouse-probe-mouse.Tpo .deps/hald_probe_mouse-probe-mouse.Po
mv -f .deps/hald_probe_storage-probe-storage.Tpo .deps/hald_probe_storage-probe-storage.Po
mv -f .deps/hald_probe_volume-probe-volume.Tpo .deps/hald_probe_volume-probe-volume.Po
mv -f .deps/hald_probe_volume-freebsd_dvd_rw_utils.Tpo .deps/hald_probe_volume-freebsd_dvd_rw_utils.Po
mv -f .deps/hald_probe_storage-freebsd_dvd_rw_utils.Tpo .deps/hald_probe_storage-freebsd_dvd_rw_utils.Po
gmake[5]: Leaving directory '/magus/work/usr/mports/sysutils/hal/work/hal-0.5.14/hald/freebsd/probing'
Makefile:443: recipe for target 'all-recursive' failed
gmake[4]: *** [all-recursive] Error 1
gmake[4]: Leaving directory '/magus/work/usr/mports/sysutils/hal/work/hal-0.5.14/hald/freebsd'
Makefile:645: recipe for target 'all-recursive' failed
gmake[3]: *** [all-recursive] Error 1
gmake[3]: Leaving directory '/magus/work/usr/mports/sysutils/hal/work/hal-0.5.14/hald'
Makefile:409: recipe for target 'all' failed
gmake[2]: *** [all] Error 2
gmake[2]: Leaving directory '/magus/work/usr/mports/sysutils/hal/work/hal-0.5.14/hald'
Makefile:429: recipe for target 'all-recursive' failed
gmake[1]: *** [all-recursive] Error 1
gmake[1]: Leaving directory '/magus/work/usr/mports/sysutils/hal/work/hal-0.5.14'
Makefile:312: recipe for target 'all' failed
gmake: *** [all] Error 2
===> Compilation failed unexpectedly.
Try to set MAKE_JOBS_UNSAFE=yes and rebuild before reporting the failure to
the maintainer.
*** [do-build] Error code 1

Stop in /usr/mports/sysutils/hal.