MidnightBSD Magus

x11-wm/etoile-azalea

Azalea is a GNUstep window mamager

Flavor Version Run OSVersion Arch License Restricted Status
0.2_2 308 0.7 amd64 gpl2 0 fail

Events

Machine Type Time Message
defiant info 2015-08-22 15:29:43.934002 Test Started
defiant fail 2015-08-22 15:38:50.218245 make build returned non-zero: 1
defiant fail 2015-08-22 15:38:50.32951 Test complete.

Log

===>  Building for etoile-azalea-0.2_2
This is gnustep-make 2.6.7. Type 'gmake print-gnustep-make-help' for help.
Making all in Frameworks ...
Making all in EtoileFoundation ...

Build Project: EtoileFoundation

Making build-headers in subprojects of framework EtoileFoundation...
Making build-headers for subproject libEtoileFoundation...
 Creating ../EtoileFoundation.framework/Versions/0/Headers...
Making build-headers for framework EtoileFoundation...
 Creating EtoileFoundation.framework/Versions/0/Headers/EtoileCompatibility.h...
 Creating EtoileFoundation.framework/Versions/0/Headers/NSFileManager+NameForTempFile.h...
 Creating EtoileFoundation.framework/Versions/0/Headers/UKMainThreadProxy.h...
 Creating EtoileFoundation.framework/Versions/0/Headers/UKPluginsRegistry.h...
 Creating EtoileFoundation.framework/Versions/0/Headers/UKPushbackMessenger.h...
 Creating EtoileFoundation.framework/Versions/0/Headers/UKThreadMessenger.h...
 Creating EtoileFoundation.framework/Versions/0/Headers/OSBundleExtensionLoader.h...
 Creating EtoileFoundation.framework/Versions/0/Headers/UKKQueue.h...
 Creating EtoileFoundation.framework/Versions/0/Headers/UKFileWatcher.h...
 Creating derived_src/.stamp...
 Creating EtoileFoundation.framework/Versions/0/Resources...
 Updating Version/Current symlink...
Making all in subprojects of framework EtoileFoundation...
Making all for subproject libEtoileFoundation...
 Compiling file NSFileManager+NameForTempFile.m ...
 Compiling file UKPluginsRegistry.m ...
 Compiling file UKMainThreadProxy.m ...
 Compiling file UKThreadMessenger.m ...
 Compiling file UKPushbackMessenger.m ...
 Compiling file OSBundleExtensionLoader.m ...
UKThreadMessenger.m:74:13: warning: implicit declaration of function 'usleep' is invalid in C99 [-Wimplicit-function-declaration]
            usleep(1000);
            ^
UKThreadMessenger.m:56:1: warning: conflicting distributed object modifiers on return type in implementation of 'release' [-Wdistributed-object-modifiers]
-(void) release
^ ~~~~
/usr/local/GNUstep/System/Library/Headers/Foundation/NSObject.h:180:1: note: previous declaration is here
- (oneway void) release NS_AUTOMATED_REFCOUNT_UNAVAILABLE;
^         ~~~~
In file included from UKPluginsRegistry.m:30:
/magus/work/usr/mports/x11-wm/etoile-azalea/work/Etoile-0.2/Frameworks/EtoileFoundation/Headers/UKPluginsRegistry.h:33:42: warning: cannot find protocol definition for 'UKTest'
@interface UKPluginsRegistry : NSObject 
                                         ^
UKPluginsRegistry.m:308:19: warning: incompatible pointer types assigning to 'NSImage *' from 'NSNull *' [-Wincompatible-pointer-types]
            image = [NSNull null];
                  ^ ~~~~~~~~~~~~~
2 warnings generated.
2 warnings generated.
 Linking subproject libEtoileFoundation ...
clang: warning: argument unused during compilation: '-pthread'
Making all for framework EtoileFoundation...
 Creating derived_src/NSFramework_EtoileFoundation.m...
 Compiling file derived_src/NSFramework_EtoileFoundation.m ...
 Linking framework EtoileFoundation ...
 Copying resources from subprojects into the framework wrapper...
 Creating EtoileFoundation.framework/Versions/0/Resources/Info-gnustep.plist...
Making all in EtoileUI ...

Build Project: EtoileUI

Making build-headers in subprojects of framework EtoileUI...
Making build-headers for subproject libEtoileUI...
 Creating ../EtoileUI.framework/Versions/0/Headers...
Making build-headers for framework EtoileUI...
 Creating EtoileUI.framework/Versions/0/Headers/EtoileCompatibility.h...
 Creating EtoileUI.framework/Versions/0/Headers/NSBezierPathCappedBoxes.h...
 Creating EtoileUI.framework/Versions/0/Headers/NSImage+NiceScaling.h...
 Creating EtoileUI.framework/Versions/0/Headers/UKNibOwner.h...
 Creating derived_src/.stamp...
 Creating EtoileUI.framework/Versions/0/Resources...
 Updating Version/Current symlink...
Making all in subprojects of framework EtoileUI...
Making all for subproject libEtoileUI...
 Compiling file NSBezierPathCappedBoxes.m ...
 Compiling file NSImage+NiceScaling.m ...
 Compiling file UKNibOwner.m ...
 Linking subproject libEtoileUI ...
clang: warning: argument unused during compilation: '-pthread'
Making all for framework EtoileUI...
 Creating derived_src/NSFramework_EtoileUI.m...
 Compiling file derived_src/NSFramework_EtoileUI.m ...
 Linking framework EtoileUI ...
 Copying resources from subprojects into the framework wrapper...
 Creating EtoileUI.framework/Versions/0/Resources/Info-gnustep.plist...
Making all in DistributedView ...

Build Project: DistributedView

Making build-headers for framework DistributedView...
 Creating DistributedView.framework/Versions/0/Headers...
 Creating DistributedView.framework/Versions/0/Headers/EtoileCompatibility.h...
 Creating DistributedView.framework/Versions/0/Headers/UKDistributedView.h...
 Creating DistributedView.framework/Versions/0/Headers/UKFinderIconCell.h...
 Creating derived_src/.stamp...
 Creating DistributedView.framework/Versions/0/Resources...
 Updating Version/Current symlink...
Making all for framework DistributedView...
 Compiling file UKDistributedView.m ...
 Compiling file UKFinderIconCell.m ...
UKDistributedView.m:134:90: warning: incompatible pointer types sending 'unsigned int *' to parameter of type 'NSUInteger *' (aka 'unsigned long *') [-Wincompatible-pointer-types]
        cellSize = *(NSSize*)[decoder decodeBytesForKey: @"UKDVcellSize" returnedLength: &len];
                                                                                         ^~~~
/usr/local/GNUstep/System/Library/Headers/Foundation/NSCoder.h:260:38: note: passing argument to parameter 'alength' here
                      returnedLength: (NSUInteger*)alength;
                                                   ^
UKDistributedView.m:135:90: warning: incompatible pointer types sending 'unsigned int *' to parameter of type 'NSUInteger *' (aka 'unsigned long *') [-Wincompatible-pointer-types]
        gridSize = *(NSSize*)[decoder decodeBytesForKey: @"UKDVgridSize" returnedLength: &len];
                                                                                         ^~~~
/usr/local/GNUstep/System/Library/Headers/Foundation/NSCoder.h:260:38: note: passing argument to parameter 'alength' here
                      returnedLength: (NSUInteger*)alength;
                                                   ^
UKDistributedView.m:1466:69: warning: cast to 'void *' from smaller integer type 'int' [-Wint-to-void-pointer-cast]
                [self addToolTipRect: currBox owner: self userData: (void*) x];
                                                                    ^
UKFinderIconCell.m:722:46: warning: conflicting parameter types in implementation of 'selectWithFrame:inView:editor:delegate:start:length:': 'NSInteger' (aka 'long') vs 'int' [-Wmismatched-parameter-types]
            delegate:(id)anObject start:(int)selStart length:(int)selLength
                                         ~~~ ^
/usr/local/GNUstep/System/Library/Headers/AppKit/NSCell.h:508:22: note: previous definition is here
                  start:(NSInteger)selStart      
                         ~~~~~~~~~ ^
UKFinderIconCell.m:722:67: warning: conflicting parameter types in implementation of 'selectWithFrame:inView:editor:delegate:start:length:': 'NSInteger' (aka 'long') vs 'int' [-Wmismatched-parameter-types]
            delegate:(id)anObject start:(int)selStart length:(int)selLength
                                                              ~~~ ^
/usr/local/GNUstep/System/Library/Headers/AppKit/NSCell.h:509:22: note: previous definition is here
                 length:(NSInteger)selLength;
                         ~~~~~~~~~ ^
UKFinderIconCell.m:871:33: warning: comparison of unsigned expression < 0 is always false [-Wtautological-compare]
        if( rangeToCut.location < 0 || (rangeToCut.location +rangeToCut.length) > [s length] )
            ~~~~~~~~~~~~~~~~~~~ ^ ~
3 warnings generated.
3 warnings generated.
 Creating derived_src/NSFramework_DistributedView.m...
 Compiling file derived_src/NSFramework_DistributedView.m ...
 Linking framework DistributedView ...
 Creating DistributedView.framework/Versions/0/Resources/Info-gnustep.plist...
Making all in OgreKit ...
Making build-headers in subprojects of framework OgreKit...
Making build-headers in subprojects of subproject Source...
Making build-headers for subproject RegularExpression...
 Creating ../../OgreKit.framework/Versions/0/Headers...
Making build-headers in subprojects of subproject FindPanel...
Making build-headers for subproject FindPanel_TextView...
gmake[6]: Nothing to be done for 'internal-subproject-build-headers'.
Making build-headers for subproject FindPanel...
gmake[5]: Nothing to be done for 'internal-subproject-build-headers'.
Making build-headers for subproject Source...
gmake[4]: Nothing to be done for 'internal-subproject-build-headers'.
Making build-headers for framework OgreKit...
 Creating OgreKit.framework/Versions/0/Headers/NSString_OgreKitAdditions.h...
 Creating OgreKit.framework/Versions/0/Headers/OGAttributedString.h...
 Creating OgreKit.framework/Versions/0/Headers/OGMutableAttributedString.h...
 Creating OgreKit.framework/Versions/0/Headers/OGMutablePlainString.h...
 Creating OgreKit.framework/Versions/0/Headers/OGMutableString.h...
 Creating OgreKit.framework/Versions/0/Headers/OGPlainString.h...
 Creating OgreKit.framework/Versions/0/Headers/OGRegularExpression.h...
 Creating OgreKit.framework/Versions/0/Headers/OGRegularExpressionCapture.h...
 Creating OgreKit.framework/Versions/0/Headers/OGRegularExpressionEnumerator.h...
 Creating OgreKit.framework/Versions/0/Headers/OGRegularExpressionFormatter.h...
 Creating OgreKit.framework/Versions/0/Headers/OGRegularExpressionMatch.h...
 Creating OgreKit.framework/Versions/0/Headers/OGReplaceExpression.h...
 Creating OgreKit.framework/Versions/0/Headers/OGString.h...
 Creating OgreKit.framework/Versions/0/Headers/OgreFindAllThread.h...
 Creating OgreKit.framework/Versions/0/Headers/OgreFindThread.h...
 Creating OgreKit.framework/Versions/0/Headers/OgreHighlightThread.h...
 Creating OgreKit.framework/Versions/0/Headers/OgreReplaceAllThread.h...
 Creating OgreKit.framework/Versions/0/Headers/OgreReplaceAndFindThread.h...
 Creating OgreKit.framework/Versions/0/Headers/OgreTextFindBranch.h...
 Creating OgreKit.framework/Versions/0/Headers/OgreTextFindComponent.h...
 Creating OgreKit.framework/Versions/0/Headers/OgreTextFindComponentEnumerator.h...
 Creating OgreKit.framework/Versions/0/Headers/OgreTextFindLeaf.h...
 Creating OgreKit.framework/Versions/0/Headers/OgreTextFindReverseComponentEnumerator.h...
 Creating OgreKit.framework/Versions/0/Headers/OgreTextFindRoot.h...
 Creating OgreKit.framework/Versions/0/Headers/OgreTextFindThread.h...
 Creating OgreKit.framework/Versions/0/Headers/OgreTextFinder.h...
 Creating OgreKit.framework/Versions/0/Headers/OgreFindResultBranch.h...
 Creating OgreKit.framework/Versions/0/Headers/OgreFindResultLeaf.h...
 Creating OgreKit.framework/Versions/0/Headers/OgreFindResultRoot.h...
 Creating OgreKit.framework/Versions/0/Headers/OgreTextFindResult.h...
 Creating OgreKit.framework/Versions/0/Headers/OgreFindPanelController.h...
 Creating OgreKit.framework/Versions/0/Headers/OgreFindResultWindowController.h...
 Creating OgreKit.framework/Versions/0/Headers/OgreKit.h...
 Creating OgreKit.framework/Versions/0/Headers/OgreOutlineColumn.h...
 Creating OgreKit.framework/Versions/0/Headers/OgreOutlineView.h...
 Creating OgreKit.framework/Versions/0/Headers/OgreTableColumn.h...
 Creating OgreKit.framework/Versions/0/Headers/OgreTableView.h...
 Creating OgreKit.framework/Versions/0/Headers/OgreTextFindProgressSheet.h...
 Creating OgreKit.framework/Versions/0/Headers/OgreView.h...
 Creating OgreKit.framework/Versions/0/Headers/OgreTextView.h...
 Creating OgreKit.framework/Versions/0/Headers/OgreTextViewAdapter.h...
 Creating OgreKit.framework/Versions/0/Headers/OgreTextViewFindResult.h...
 Creating OgreKit.framework/Versions/0/Headers/OgreTextViewGraphicAllowedAdapter.h...
 Creating OgreKit.framework/Versions/0/Headers/OgreTextViewMatchFindResult.h...
 Creating OgreKit.framework/Versions/0/Headers/OgreTextViewPlainAdapter.h...
 Creating OgreKit.framework/Versions/0/Headers/OgreTextViewRichAdapter.h...
 Creating OgreKit.framework/Versions/0/Headers/OgreTextViewUndoer.h...
 Creating OgreKit.framework/Versions/0/Headers/OgreUnhighlightThread.h...
 Creating derived_src/.stamp...
 Creating OgreKit.framework/Versions/0/Resources...
 Updating Version/Current symlink...

Build Project: OgreKit

Making all in subprojects of framework OgreKit...
Making all in subprojects of subproject Source...
Making all for subproject RegularExpression...
 Compiling file NSString_OgreKitAdditions.m ...
onig-config: not found
onig-config: not found
 Compiling file OGAttributedString.m ...
onig-config: not found
 Compiling file OGRegularExpressionEnumeratorPrivate.m ...
onig-config: not found
 Compiling file OGRegularExpressionFormatter.m ...
onig-config: not found
onig-config: not found
onig-config: not found
 Compiling file OGMutableAttributedString.m ...
onig-config: not found
onig-config: not found
onig-config: not found
onig-config: not found
onig-config: not found
onig-config: not found
 Compiling file OGRegularExpressionMatch.m ...
onig-config: not found
 Compiling file OGMutablePlainString.m ...
onig-config: not found
onig-config: not found
onig-config: not found
onig-config: not found
 Compiling file OGRegularExpressionMatchPrivate.m ...
onig-config: not found
onig-config: not found
onig-config: not found
onig-config: not found
onig-config: not found
onig-config: not found
OGRegularExpressionMatch.m:20:9: fatal error: 'oniguruma.h' file not found
#import 
        ^
In file included from NSString_OgreKitAdditions.m:14:
In file included from /magus/work/usr/mports/x11-wm/etoile-azalea/work/Etoile-0.2/Frameworks/OgreKit/OgreKit/NSString_OgreKitAdditions.h:14:
/magus/work/usr/mports/x11-wm/etoile-azalea/work/Etoile-0.2/Frameworks/OgreKit/OgreKit/OGRegularExpression.h:21:9: fatal error: 'oniguruma.h' file not found
#import 
        ^
In file included from OGRegularExpressionEnumeratorPrivate.m:14:
/magus/work/usr/mports/x11-wm/etoile-azalea/work/Etoile-0.2/Frameworks/OgreKit/OgreKit/OGRegularExpression.h:21:9: fatal error: 'oniguruma.h' file not found
#import 
        ^
In file included from OGRegularExpressionFormatter.m:14:
In file included from /magus/work/usr/mports/x11-wm/etoile-azalea/work/Etoile-0.2/Frameworks/OgreKit/OgreKit/OGRegularExpressionFormatter.h:15:
/magus/work/usr/mports/x11-wm/etoile-azalea/work/Etoile-0.2/Frameworks/OgreKit/OgreKit/OGRegularExpression.h:21:9: fatal error: 'oniguruma.h' file not found
#import 
        ^
1 error generated.
1 error generated.
/usr/local/GNUstep/System/Library/Makefiles/rules.make:479: recipe for target 'obj/RegularExpression.obj/NSString_OgreKitAdditions.m.o' failed
gmake[6]: *** [obj/RegularExpression.obj/NSString_OgreKitAdditions.m.o] Error 1
gmake[6]: *** Waiting for unfinished jobs....
/usr/local/GNUstep/System/Library/Makefiles/rules.make:479: recipe for target 'obj/RegularExpression.obj/OGRegularExpressionEnumeratorPrivate.m.o' failed
gmake[6]: *** [obj/RegularExpression.obj/OGRegularExpressionEnumeratorPrivate.m.o] Error 1
In file included from OGRegularExpressionMatchPrivate.m:14:
/magus/work/usr/mports/x11-wm/etoile-azalea/work/Etoile-0.2/Frameworks/OgreKit/OgreKit/OGRegularExpression.h:21:9: fatal error: 'oniguruma.h' file not found
#import 
        ^
1 error generated.
1 error generated.
/usr/local/GNUstep/System/Library/Makefiles/rules.make:479: recipe for target 'obj/RegularExpression.obj/OGRegularExpressionMatch.m.o' failed
gmake[6]: *** [obj/RegularExpression.obj/OGRegularExpressionMatch.m.o] Error 1
/usr/local/GNUstep/System/Library/Makefiles/rules.make:479: recipe for target 'obj/RegularExpression.obj/OGRegularExpressionFormatter.m.o' failed
gmake[6]: *** [obj/RegularExpression.obj/OGRegularExpressionFormatter.m.o] Error 1
1 error generated.
/usr/local/GNUstep/System/Library/Makefiles/rules.make:479: recipe for target 'obj/RegularExpression.obj/OGRegularExpressionMatchPrivate.m.o' failed
gmake[6]: *** [obj/RegularExpression.obj/OGRegularExpressionMatchPrivate.m.o] Error 1
/usr/local/GNUstep/System/Library/Makefiles/Instance/subproject.make:45: recipe for target 'internal-subproject-all_' failed
gmake[5]: *** [internal-subproject-all_] Error 2
/usr/local/GNUstep/System/Library/Makefiles/Master/rules.make:311: recipe for target 'RegularExpression.all.subproject.variables' failed
gmake[4]: *** [RegularExpression.all.subproject.variables] Error 2
/usr/local/GNUstep/System/Library/Makefiles/Master/rules.make:311: recipe for target 'Source.all.subproject.variables' failed
gmake[3]: *** [Source.all.subproject.variables] Error 2
/usr/local/GNUstep/System/Library/Makefiles/Master/rules.make:311: recipe for target 'OgreKit.all.framework.variables' failed
gmake[2]: *** [OgreKit.all.framework.variables] Error 2
/usr/local/GNUstep/System/Library/Makefiles/Master/serial-subdirectories.make:53: recipe for target 'internal-all' failed
gmake[1]: *** [internal-all] Error 2
/usr/local/GNUstep/System/Library/Makefiles/Master/serial-subdirectories.make:53: recipe for target 'internal-all' failed
gmake: *** [internal-all] Error 2
===> Compilation failed unexpectedly.
Try to set MAKE_JOBS_UNSAFE=yes and rebuild before reporting the failure to
the maintainer.
*** [do-build] Error code 1

Stop in /usr/mports/x11-wm/etoile-azalea.