MidnightBSD Magus


User account information retrieval utility

Flavor Version Run OSVersion Arch License Restricted Status
1.1.2 322 0.8 amd64 gpl2 0 fail


Machine Type Time Message
m5 info 2016-08-01 23:21:36.103478 Test Started
m5 fail 2016-08-01 23:21:55.433158 make build returned non-zero: 1
m5 fail 2016-08-01 23:21:55.614352 Test complete.


===>  Building for courieruserinfo-1.1.2
gmake  all-recursive
gmake[1]: Entering directory '/magus/work/usr/mports/security/courieruserinfo/work/courieruserinfo-1.1.2'
Making all in replace
gmake[2]: Entering directory '/magus/work/usr/mports/security/courieruserinfo/work/courieruserinfo-1.1.2/replace'
rm -f libreplace.a
ar cru libreplace.a  
ranlib libreplace.a
gmake[2]: Leaving directory '/magus/work/usr/mports/security/courieruserinfo/work/courieruserinfo-1.1.2/replace'
gmake[2]: Entering directory '/magus/work/usr/mports/security/courieruserinfo/work/courieruserinfo-1.1.2'
cc -DHAVE_CONFIG_H -I. -I. -I.   -I/usr/local/include  -O2 -pipe -fno-strict-aliasing -c getopt_long.c
cc -DHAVE_CONFIG_H -I. -I. -I.   -I/usr/local/include  -O2 -pipe -fno-strict-aliasing -c courieruserinfo.c
cc -DHAVE_CONFIG_H -I. -I. -I.   -I/usr/local/include  -O2 -pipe -fno-strict-aliasing -c xmalloc.c
getopt_long.c:66:27: warning: '/*' within block comment [-Wcomment]
/*#define GNU_COMPATIBLE                /* Be more compatible, configure's use us! */
1 warning generated.
/bin/sh ./libtool --mode=link cc  -O2 -pipe -fno-strict-aliasing -L/usr/local/lib -o courieruserinfo  courieruserinfo.o getopt_long.o xmalloc.o -L/usr/local/lib/courier-authlib -lcourierauth ./replace/libreplace.a 
mkdir .libs
cc -O2 -pipe -fno-strict-aliasing -o courieruserinfo courieruserinfo.o getopt_long.o xmalloc.o  -L/usr/local/lib -L/usr/local/lib/courier-authlib -lcourierauth ./replace/libreplace.a
/usr/bin/ld: cannot find -lcourierauth
cc: error: linker command failed with exit code 1 (use -v to see invocation)
Makefile:257: recipe for target 'courieruserinfo' failed
gmake[2]: *** [courieruserinfo] Error 1
gmake[2]: Leaving directory '/magus/work/usr/mports/security/courieruserinfo/work/courieruserinfo-1.1.2'
Makefile:311: recipe for target 'all-recursive' failed
gmake[1]: *** [all-recursive] Error 1
gmake[1]: Leaving directory '/magus/work/usr/mports/security/courieruserinfo/work/courieruserinfo-1.1.2'
Makefile:461: recipe for target 'all-recursive-am' failed
gmake: *** [all-recursive-am] Error 2
===> Compilation failed unexpectedly.
Try to set MAKE_JOBS_UNSAFE=yes and rebuild before reporting the failure to
the maintainer.
*** [do-build] Error code 1

Stop in /usr/mports/security/courieruserinfo.