MidnightBSD Magus

lang/php70

PHP Scripting Language

Flavor Version Run OSVersion Arch License Restricted Status
7.0.9 324 0.8 i386 php 0 fail

Events

Machine Type Time Message
Constellation info 2016-08-13 12:07:51.319498 Test Started
Constellation fail 2016-08-13 12:08:48.049398 make build returned non-zero: 1
Constellation fail 2016-08-13 12:08:48.185611 Test complete.

Log

===>  Building for php70-7.0.9
/bin/sh /magus/work/usr/mports/lang/php70/work/php-7.0.9/libtool --silent --preserve-dup-deps --mode=compile clang -Iext/date/lib -DZEND_ENABLE_STATIC_TSRMLS_CACHE=1 -DHAVE_TIMELIB_CONFIG_H=1 -Iext/date/ -I/magus/work/usr/mports/lang/php70/work/php-7.0.9/ext/date/ -DPHP_ATOM_INC -I/magus/work/usr/mports/lang/php70/work/php-7.0.9/include -I/magus/work/usr/mports/lang/php70/work/php-7.0.9/main -I/magus/work/usr/mports/lang/php70/work/php-7.0.9 -I/magus/work/usr/mports/lang/php70/work/php-7.0.9/ext/date/lib -I/usr/local/include/libxml2 -I/usr/local/include -I/magus/work/usr/mports/lang/php70/work/php-7.0.9/TSRM -I/magus/work/usr/mports/lang/php70/work/php-7.0.9/Zend    -O2 -pipe -fno-strict-aliasing   -c /magus/work/usr/mports/lang/php70/work/php-7.0.9/ext/date/php_date.c -o ext/date/php_date.lo
/bin/sh /magus/work/usr/mports/lang/php70/work/php-7.0.9/libtool --silent --preserve-dup-deps --mode=compile clang -Iext/date/lib -DZEND_ENABLE_STATIC_TSRMLS_CACHE=1 -DHAVE_TIMELIB_CONFIG_H=1 -Iext/date/ -I/magus/work/usr/mports/lang/php70/work/php-7.0.9/ext/date/ -DPHP_ATOM_INC -I/magus/work/usr/mports/lang/php70/work/php-7.0.9/include -I/magus/work/usr/mports/lang/php70/work/php-7.0.9/main -I/magus/work/usr/mports/lang/php70/work/php-7.0.9 -I/magus/work/usr/mports/lang/php70/work/php-7.0.9/ext/date/lib -I/usr/local/include/libxml2 -I/usr/local/include -I/magus/work/usr/mports/lang/php70/work/php-7.0.9/TSRM -I/magus/work/usr/mports/lang/php70/work/php-7.0.9/Zend    -O2 -pipe -fno-strict-aliasing   -c /magus/work/usr/mports/lang/php70/work/php-7.0.9/ext/date/lib/astro.c -o ext/date/lib/astro.lo
/bin/sh /magus/work/usr/mports/lang/php70/work/php-7.0.9/libtool --silent --preserve-dup-deps --mode=compile clang -Iext/date/lib -DZEND_ENABLE_STATIC_TSRMLS_CACHE=1 -DHAVE_TIMELIB_CONFIG_H=1 -Iext/date/ -I/magus/work/usr/mports/lang/php70/work/php-7.0.9/ext/date/ -DPHP_ATOM_INC -I/magus/work/usr/mports/lang/php70/work/php-7.0.9/include -I/magus/work/usr/mports/lang/php70/work/php-7.0.9/main -I/magus/work/usr/mports/lang/php70/work/php-7.0.9 -I/magus/work/usr/mports/lang/php70/work/php-7.0.9/ext/date/lib -I/usr/local/include/libxml2 -I/usr/local/include -I/magus/work/usr/mports/lang/php70/work/php-7.0.9/TSRM -I/magus/work/usr/mports/lang/php70/work/php-7.0.9/Zend    -O2 -pipe -fno-strict-aliasing   -c /magus/work/usr/mports/lang/php70/work/php-7.0.9/ext/date/lib/dow.c -o ext/date/lib/dow.lo
In file included from /magus/work/usr/mports/lang/php70/work/php-7.0.9/ext/date/php_date.c:21:
In file included from /magus/work/usr/mports/lang/php70/work/php-7.0.9/main/php.h:35:
In file included from /magus/work/usr/mports/lang/php70/work/php-7.0.9/Zend/zend.h:36:
/magus/work/usr/mports/lang/php70/work/php-7.0.9/Zend/zend_hash.h:134:15: error: variadic function cannot use fastcall calling convention
ZEND_API void ZEND_FASTCALL zend_hash_apply_with_arguments(HashTable *ht, apply_func_args_t apply_func, int, ...);
              ^
/magus/work/usr/mports/lang/php70/work/php-7.0.9/Zend/zend_portability.h:231:39: note: expanded from macro 'ZEND_FASTCALL'
# define ZEND_FASTCALL __attribute__((fastcall))
                                      ^
In file included from /magus/work/usr/mports/lang/php70/work/php-7.0.9/ext/date/lib/astro.c:31:
In file included from ext/date/lib/timelib.h:28:
In file included from ext/date/lib/timelib_structs.h:29:
In file included from ext/date/lib/timelib_config.h:9:
In file included from /magus/work/usr/mports/lang/php70/work/php-7.0.9/Zend/zend.h:36:
/magus/work/usr/mports/lang/php70/work/php-7.0.9/Zend/zend_hash.h:134:15: error: variadic function cannot use fastcall calling convention
ZEND_API void ZEND_FASTCALL zend_hash_apply_with_arguments(HashTable *ht, apply_func_args_t apply_func, int, ...);
              ^
/magus/work/usr/mports/lang/php70/work/php-7.0.9/Zend/zend_portability.h:231:39: note: expanded from macro 'ZEND_FASTCALL'
# define ZEND_FASTCALL __attribute__((fastcall))
                                      ^
In file included from /magus/work/usr/mports/lang/php70/work/php-7.0.9/ext/date/lib/dow.c:25:
In file included from ext/date/lib/timelib.h:28:
In file included from ext/date/lib/timelib_structs.h:29:
In file included from ext/date/lib/timelib_config.h:9:
In file included from /magus/work/usr/mports/lang/php70/work/php-7.0.9/Zend/zend.h:36:
/magus/work/usr/mports/lang/php70/work/php-7.0.9/Zend/zend_hash.h:134:15: error: variadic function cannot use fastcall calling convention
ZEND_API void ZEND_FASTCALL zend_hash_apply_with_arguments(HashTable *ht, apply_func_args_t apply_func, int, ...);
              ^
/magus/work/usr/mports/lang/php70/work/php-7.0.9/Zend/zend_portability.h:231:39: note: expanded from macro 'ZEND_FASTCALL'
# define ZEND_FASTCALL __attribute__((fastcall))
                                      ^
1 error generated.
*** [ext/date/lib/astro.lo] Error code 1
1 error generated.
*** [ext/date/lib/dow.lo] Error code 1
1 error generated.
*** [ext/date/php_date.lo] Error code 1
3 errors
===> Compilation failed unexpectedly.
Try to set MAKE_JOBS_UNSAFE=yes and rebuild before reporting the failure to
the maintainer.
*** [do-build] Error code 1

Stop in /usr/mports/lang/php70.

Links

Depends On

Depend Of

Categories