MidnightBSD Magus

databases/postgresql-libpqxx

New C++ interface for PostgreSQL

Flavor Version Run OSVersion Arch License Restricted Status
4.0.1_2 329 0.10 amd64 bsd3 0 fail

Events

Machine Type Time Message
defiant fail 2017-09-26 16:10:48.608106 make build returned non-zero: 1
defiant info 2017-09-26 16:09:30.474127 Test Started
defiant fail 2017-09-26 16:10:48.979145 Test complete.

Log

===>  Building for postgresql-libpqxx-4.0.1_2
gmake[1]: Entering directory '/magus/work/usr/mports/databases/postgresql-libpqxx/work/libpqxx-4.0.1'
Making all in include
gmake[2]: Entering directory '/magus/work/usr/mports/databases/postgresql-libpqxx/work/libpqxx-4.0.1/include'
Making all in pqxx
gmake[3]: Entering directory '/magus/work/usr/mports/databases/postgresql-libpqxx/work/libpqxx-4.0.1/include/pqxx'
gmake  all-am
gmake[4]: Entering directory '/magus/work/usr/mports/databases/postgresql-libpqxx/work/libpqxx-4.0.1/include/pqxx'
gmake[4]: *** No rule to make target 'config-internal-compiler.h', needed by 'all-am'.  Stop.
gmake[4]: *** Waiting for unfinished jobs....
gmake[4]: Leaving directory '/magus/work/usr/mports/databases/postgresql-libpqxx/work/libpqxx-4.0.1/include/pqxx'
gmake[3]: *** [Makefile:231: all] Error 2
gmake[3]: Leaving directory '/magus/work/usr/mports/databases/postgresql-libpqxx/work/libpqxx-4.0.1/include/pqxx'
gmake[2]: *** [Makefile:440: all-recursive] Error 1
gmake[2]: Leaving directory '/magus/work/usr/mports/databases/postgresql-libpqxx/work/libpqxx-4.0.1/include'
gmake[1]: *** [Makefile:429: all-recursive] Error 1
gmake[1]: Leaving directory '/magus/work/usr/mports/databases/postgresql-libpqxx/work/libpqxx-4.0.1'
===> Compilation failed unexpectedly.
Try to set MAKE_JOBS_UNSAFE=yes and rebuild before reporting the failure to
the maintainer.
*** Error code 1

Stop.
make: stopped in /usr/mports/databases/postgresql-libpqxx