MidnightBSD Magus

emulators/adamem

ADAMEm is a portable Coleco ADAM and ColecoVision emulator

Flavor Version Run OSVersion Arch License Restricted Status
1.0_2 339 1.0 amd64 ADAMEm 1 fail

Events

Machine Type Time Message
Constellation10 info 2018-09-03 19:13:49.424192 Test Started
Constellation10 fail 2018-09-03 19:13:56.923028 make build returned non-zero: 1
Constellation10 fail 2018-09-03 19:13:57.073612 Test complete.

Log

===>  Building for adamem-1.0_2
--- x ---
make -f Makefile.X
--- ADAMEm.o ---
--- Coleco.o ---
--- ADAMEm.o ---
gcc -Wall -O2 -fomit-frame-pointer  -DLSB_FIRST -DUNIX_X -DUNIX -DMITSHM -DHAVE_CLOCK -DSOUND -DZLIB  -I/usr/local/include -c ADAMEm.c -o ADAMEm.o
--- Coleco.o ---
gcc -Wall -O2 -fomit-frame-pointer  -DLSB_FIRST -DUNIX_X -DUNIX -DMITSHM -DHAVE_CLOCK -DSOUND -DZLIB  -I/usr/local/include -c Coleco.c -o Coleco.o
gcc: not found
--- ADAMEm.o ---
gcc: not found
--- Coleco.o ---
*** [Coleco.o] Error code 127

make[2]: stopped in /magus/work/usr/mports/emulators/adamem/work/adamem-1.0_2
--- ADAMEm.o ---
*** [ADAMEm.o] Error code 127

make[2]: stopped in /magus/work/usr/mports/emulators/adamem/work/adamem-1.0_2
2 errors

make[2]: stopped in /magus/work/usr/mports/emulators/adamem/work/adamem-1.0_2
*** [x] Error code 2

make[1]: stopped in /magus/work/usr/mports/emulators/adamem/work/adamem-1.0_2
1 error

make[1]: stopped in /magus/work/usr/mports/emulators/adamem/work/adamem-1.0_2
===> Compilation failed unexpectedly.
Try to set MAKE_JOBS_UNSAFE=yes and rebuild before reporting the failure to
the maintainer.
*** Error code 1

Stop.
make: stopped in /usr/mports/emulators/adamem

Links

Depends On

Depend Of

Nothing

Categories