MidnightBSD Magus

misc/wmcalendar

Dockable calendar with interface to iCalendar based calendars

Flavor Version Run OSVersion Arch License Restricted Status
0.5.2_3 350 1.0 amd64 gpl2 0 fail

Events

Machine Type Time Message
Constellation10 fail 2019-01-05 22:42:50.905184 Test complete.
Constellation10 fail 2019-01-05 22:42:50.761788 make build returned non-zero: 1
Constellation10 info 2019-01-05 22:41:32.987918 Test Started

Log

===>  Building for wmcalendar-0.5.2_3
pkg-config: not found
pkg-config: not found
--- wmCalendar.o ---
--- settings.o ---
--- wmCalendar.o ---
cc -O2 -pipe  -fno-strict-aliasing -D`uname -s` -DHAVE_SYS_TIME_H -c wmCalendar.c -o wmCalendar.o -I/usr/local/include
--- settings.o ---
cc -O2 -pipe  -fno-strict-aliasing -D`uname -s` -DHAVE_SYS_TIME_H -c settings.c -o settings.o -I/usr/local/include
--- wmCalendar.o ---
In file included from wmCalendar.c:10:
--- settings.o ---
In file included from settings.c:1:
./settings.h:2:10: fatal error: 'gtk/gtk.h' file not found
--- wmCalendar.o ---
In file included from ./wmCalendar.h:68:
./settings.h:2:10: fatal error: 'gtk/gtk.h' file not found
#include 
         ^
--- settings.o ---
#include 
         ^
--- wmCalendar.o ---
1 error generated.
--- settings.o ---
1 error generated.
*** [settings.o] Error code 1

make[1]: stopped in /magus/work/usr/mports/misc/wmcalendar/work/wmcalendar-0.5.2/Src
--- wmCalendar.o ---
*** [wmCalendar.o] Error code 1

make[1]: stopped in /magus/work/usr/mports/misc/wmcalendar/work/wmcalendar-0.5.2/Src
2 errors

make[1]: stopped in /magus/work/usr/mports/misc/wmcalendar/work/wmcalendar-0.5.2/Src
===> Compilation failed unexpectedly.
Try to set MAKE_JOBS_UNSAFE=yes and rebuild before reporting the failure to
the maintainer.
*** Error code 1

Stop.
make: stopped in /usr/mports/misc/wmcalendar