MidnightBSD Magus

x11-drivers/xf86-input-wacom

X.Org Wacom tablet driver

Flavor Version Run OSVersion Arch License Restricted Status
0.36.1 381 1.1 i386 gpl2 0 fail

Events

Machine Type Time Message
m1132 fail 2019-07-03 00:59:59.320397 Test complete.
m1132 fail 2019-07-03 00:59:59.249449 make build returned non-zero: 1
m1132 info 2019-07-03 00:58:21.777021 Test Started

Log

===>  Building for xf86-input-wacom-0.36.1
gmake[1]: Entering directory '/magus/work/usr/mports/x11-drivers/xf86-input-wacom/work/xf86-input-wacom-0.36.1'
if test -x ./git-version-gen; then ./git-version-gen -u; fi
if ! grep -qs "^#define BUILD_VERSION \"$(cat version)\"$" "config-ver.h"; then \
    sed -i '/^#define BUILD_VERSION /d' "config-ver.h" 2>/dev/null; \
    echo "#define BUILD_VERSION \"$(cat version | tr -d '\n')\"" >> "config-ver.h"; \
fi
gmake  all-recursive
gmake[2]: Entering directory '/magus/work/usr/mports/x11-drivers/xf86-input-wacom/work/xf86-input-wacom-0.36.1'
Making all in conf
gmake[3]: Entering directory '/magus/work/usr/mports/x11-drivers/xf86-input-wacom/work/xf86-input-wacom-0.36.1/conf'
gmake[3]: Nothing to be done for 'all'.
gmake[3]: Leaving directory '/magus/work/usr/mports/x11-drivers/xf86-input-wacom/work/xf86-input-wacom-0.36.1/conf'
Making all in doc
gmake[3]: Entering directory '/magus/work/usr/mports/x11-drivers/xf86-input-wacom/work/xf86-input-wacom-0.36.1/doc'
gmake[3]: Nothing to be done for 'all'.
gmake[3]: Leaving directory '/magus/work/usr/mports/x11-drivers/xf86-input-wacom/work/xf86-input-wacom-0.36.1/doc'
Making all in src
gmake[3]: Entering directory '/magus/work/usr/mports/x11-drivers/xf86-input-wacom/work/xf86-input-wacom-0.36.1/src'
/bin/sh ../libtool  --tag=CC   --mode=compile cc -DHAVE_CONFIG_H -I. -I..  -I../include/  -I/usr/local/include/xorg -fvisibility=hidden -I/usr/local/include -I/usr/local/include/pixman-1 -I/usr/local/include/X11/dri -I/usr/local/include/libdrm -D_THREAD_SAFE -pthread  -Wall -Wpointer-arith -Wmissing-declarations -Wformat=2 -Wstrict-prototypes -Wmissing-prototypes -Wnested-externs -Wbad-function-cast -Wold-style-definition -Wdeclaration-after-statement -Wunused -Wuninitialized -Wshadow -Wmissing-noreturn -Wmissing-format-attribute -Wredundant-decls -Werror=implicit -Werror=nonnull -Werror=init-self -Werror=main -Werror=missing-braces -Werror=sequence-point -Werror=return-type -Werror=trigraphs -Werror=array-bounds -Werror=write-strings -Werror=address -Werror=int-to-pointer-cast -Werror=pointer-to-int-cast -fno-strict-aliasing  -O2 -pipe  -fno-strict-aliasing -MT xf86Wacom.lo -MD -MP -MF .deps/xf86Wacom.Tpo -c -o xf86Wacom.lo `test -f '../src/xf86Wacom.c' || echo './'`../src/xf86Wacom.c
/bin/sh ../libtool  --tag=CC   --mode=compile cc -DHAVE_CONFIG_H -I. -I..  -I../include/  -I/usr/local/include/xorg -fvisibility=hidden -I/usr/local/include -I/usr/local/include/pixman-1 -I/usr/local/include/X11/dri -I/usr/local/include/libdrm -D_THREAD_SAFE -pthread  -Wall -Wpointer-arith -Wmissing-declarations -Wformat=2 -Wstrict-prototypes -Wmissing-prototypes -Wnested-externs -Wbad-function-cast -Wold-style-definition -Wdeclaration-after-statement -Wunused -Wuninitialized -Wshadow -Wmissing-noreturn -Wmissing-format-attribute -Wredundant-decls -Werror=implicit -Werror=nonnull -Werror=init-self -Werror=main -Werror=missing-braces -Werror=sequence-point -Werror=return-type -Werror=trigraphs -Werror=array-bounds -Werror=write-strings -Werror=address -Werror=int-to-pointer-cast -Werror=pointer-to-int-cast -fno-strict-aliasing  -O2 -pipe  -fno-strict-aliasing -MT wcmCommon.lo -MD -MP -MF .deps/wcmCommon.Tpo -c -o wcmCommon.lo `test -f '../src/wcmCommon.c' || echo './'`../src/wcmCommon.c
/bin/sh ../libtool  --tag=CC   --mode=compile cc -DHAVE_CONFIG_H -I. -I..  -I../include/  -I/usr/local/include/xorg -fvisibility=hidden -I/usr/local/include -I/usr/local/include/pixman-1 -I/usr/local/include/X11/dri -I/usr/local/include/libdrm -D_THREAD_SAFE -pthread  -Wall -Wpointer-arith -Wmissing-declarations -Wformat=2 -Wstrict-prototypes -Wmissing-prototypes -Wnested-externs -Wbad-function-cast -Wold-style-definition -Wdeclaration-after-statement -Wunused -Wuninitialized -Wshadow -Wmissing-noreturn -Wmissing-format-attribute -Wredundant-decls -Werror=implicit -Werror=nonnull -Werror=init-self -Werror=main -Werror=missing-braces -Werror=sequence-point -Werror=return-type -Werror=trigraphs -Werror=array-bounds -Werror=write-strings -Werror=address -Werror=int-to-pointer-cast -Werror=pointer-to-int-cast -fno-strict-aliasing  -O2 -pipe  -fno-strict-aliasing -MT wcmConfig.lo -MD -MP -MF .deps/wcmConfig.Tpo -c -o wcmConfig.lo `test -f '../src/wcmConfig.c' || echo './'`../src/wcmConfig.c
libtool: compile:  cc -DHAVE_CONFIG_H -I. -I.. -I../include/ -I/usr/local/include/xorg -fvisibility=hidden -I/usr/local/include -I/usr/local/include/pixman-1 -I/usr/local/include/X11/dri -I/usr/local/include/libdrm -D_THREAD_SAFE -pthread -Wall -Wpointer-arith -Wmissing-declarations -Wformat=2 -Wstrict-prototypes -Wmissing-prototypes -Wnested-externs -Wbad-function-cast -Wold-style-definition -Wdeclaration-after-statement -Wunused -Wuninitialized -Wshadow -Wmissing-noreturn -Wmissing-format-attribute -Wredundant-decls -Werror=implicit -Werror=nonnull -Werror=init-self -Werror=main -Werror=missing-braces -Werror=sequence-point -Werror=return-type -Werror=trigraphs -Werror=array-bounds -Werror=write-strings -Werror=address -Werror=int-to-pointer-cast -Werror=pointer-to-int-cast -fno-strict-aliasing -O2 -pipe -fno-strict-aliasing -MT xf86Wacom.lo -MD -MP -MF .deps/xf86Wacom.Tpo -c ../src/xf86Wacom.c  -fPIC -DPIC -o .libs/xf86Wacom.o
libtool: compile:  cc -DHAVE_CONFIG_H -I. -I.. -I../include/ -I/usr/local/include/xorg -fvisibility=hidden -I/usr/local/include -I/usr/local/include/pixman-1 -I/usr/local/include/X11/dri -I/usr/local/include/libdrm -D_THREAD_SAFE -pthread -Wall -Wpointer-arith -Wmissing-declarations -Wformat=2 -Wstrict-prototypes -Wmissing-prototypes -Wnested-externs -Wbad-function-cast -Wold-style-definition -Wdeclaration-after-statement -Wunused -Wuninitialized -Wshadow -Wmissing-noreturn -Wmissing-format-attribute -Wredundant-decls -Werror=implicit -Werror=nonnull -Werror=init-self -Werror=main -Werror=missing-braces -Werror=sequence-point -Werror=return-type -Werror=trigraphs -Werror=array-bounds -Werror=write-strings -Werror=address -Werror=int-to-pointer-cast -Werror=pointer-to-int-cast -fno-strict-aliasing -O2 -pipe -fno-strict-aliasing -MT wcmConfig.lo -MD -MP -MF .deps/wcmConfig.Tpo -c ../src/wcmConfig.c  -fPIC -DPIC -o .libs/wcmConfig.o
libtool: compile:  cc -DHAVE_CONFIG_H -I. -I.. -I../include/ -I/usr/local/include/xorg -fvisibility=hidden -I/usr/local/include -I/usr/local/include/pixman-1 -I/usr/local/include/X11/dri -I/usr/local/include/libdrm -D_THREAD_SAFE -pthread -Wall -Wpointer-arith -Wmissing-declarations -Wformat=2 -Wstrict-prototypes -Wmissing-prototypes -Wnested-externs -Wbad-function-cast -Wold-style-definition -Wdeclaration-after-statement -Wunused -Wuninitialized -Wshadow -Wmissing-noreturn -Wmissing-format-attribute -Wredundant-decls -Werror=implicit -Werror=nonnull -Werror=init-self -Werror=main -Werror=missing-braces -Werror=sequence-point -Werror=return-type -Werror=trigraphs -Werror=array-bounds -Werror=write-strings -Werror=address -Werror=int-to-pointer-cast -Werror=pointer-to-int-cast -fno-strict-aliasing -O2 -pipe -fno-strict-aliasing -MT wcmCommon.lo -MD -MP -MF .deps/wcmCommon.Tpo -c ../src/wcmCommon.c  -fPIC -DPIC -o .libs/wcmCommon.o
In file included from ../src/wcmConfig.c:24:
In file included from ./xf86Wacom.h:In file included from ../src/xf86Wacom.c:46:
94:
In file included from ./xf86WacomDefs.h:30:10: fatal error: In file included from ../src/wcmCommon.c'linux/input.h' file not found./xf86Wacom.h:94:

:./xf86WacomDefs.h:30:1024:
In file included from ./xf86Wacom.h#include 
:94         ^
: fatal error: 'linux/input.h' file not found
:
./xf86WacomDefs.h:30:10: fatal error: 'linux/input.h' file not found
#include 
         ^
#include 
         ^
1 error generated.
gmake[3]: *** [Makefile:521: wcmConfig.lo] Error 1
gmake[3]: *** Waiting for unfinished jobs....
1 error generated.
gmake[3]: *** [Makefile:507: xf86Wacom.lo] Error 1
1 error generated.
gmake[3]: *** [Makefile:514: wcmCommon.lo] Error 1
gmake[3]: Leaving directory '/magus/work/usr/mports/x11-drivers/xf86-input-wacom/work/xf86-input-wacom-0.36.1/src'
gmake[2]: *** [Makefile:519: all-recursive] Error 1
gmake[2]: Leaving directory '/magus/work/usr/mports/x11-drivers/xf86-input-wacom/work/xf86-input-wacom-0.36.1'
gmake[1]: *** [Makefile:428: all] Error 2
gmake[1]: Leaving directory '/magus/work/usr/mports/x11-drivers/xf86-input-wacom/work/xf86-input-wacom-0.36.1'
===> Compilation failed unexpectedly.
Try to set MAKE_JOBS_UNSAFE=yes and rebuild before reporting the failure to
the maintainer.
*** Error code 1

Stop.
make: stopped in /usr/mports/x11-drivers/xf86-input-wacom