MidnightBSD Magus

www/webkit-qt4

Qt WebKit implementation

Flavor Version Run OSVersion Arch License Restricted Status
4.8.7_2 382 1.1 amd64 gpl3 0 fail

Events

Machine Type Time Message
m1164 fail 2019-08-18 11:46:19.757972 Test complete.
m1164 fail 2019-08-18 11:46:19.478048 make build returned non-zero: 1
m1164 info 2019-08-18 11:43:47.984776 Test Started

Log

===>  Building for qt4-webkit-4.8.7_2
--- sub-JavaScriptCore-JavaScriptCore-pro-make_default-ordered ---
cd JavaScriptCore/ && /usr/bin/make -f Makefile
--- .moc/release-static/MainThreadQt.moc ---
--- .moc/release-static/ThreadingQt.moc ---
--- .moc/release-static/MainThreadQt.moc ---
/magus/work/usr/mports/www/webkit-qt4/work/qt-everywhere-opensource-src-4.8.7/bin/moc -DNDEBUG -DBUILDING_QT__=1 -DNDEBUG -DQT_ASCII_CAST_WARNINGS -DBUILDING_JavaScriptCore -DBUILDING_WTF -DENABLE_GLIB_SUPPORT=1 -D_LARGEFILE64_SOURCE -D_LARGEFILE_SOURCE -DQT_NO_DEBUG -DQT_CORE_LIB -DQT_SHARED -I/usr/local/share/qt4/mkspecs/freebsd-g++ -I. -I../../../../../include/QtCore -I../../../../../include -I. -I../../Source -I../ThirdParty -Iassembler -Ibytecode -Ibytecompiler -Iheap -Idfg -Idebugger -Iinterpreter -Ijit -Iparser -Iprofiler -Iruntime -Iwtf -Iwtf/gobject -I/magus/work/usr/mports/www/webkit-qt4/work/qt-everywhere-opensource-src-4.8.7/src/3rdparty/webkit/Source/JavaScriptCore/wtf/symbian -Iwtf/unicode -Iyarr -IAPI -IForwardingHeaders -Igenerated -I../../Source -I../../include -I/include/QtWebKit -I/include -I/usr/local/include/glib-2.0 -I/usr/local/lib/glib-2.0/include -I/usr/local/include -I.moc/release-static -I/usr/local/include/qt4 -I/usr/local/include wtf/qt/MainThreadQt.cpp -o .moc/release-static/MainThreadQt.moc
--- .moc/release-static/ThreadingQt.moc ---
/magus/work/usr/mports/www/webkit-qt4/work/qt-everywhere-opensource-src-4.8.7/bin/moc -DNDEBUG -DBUILDING_QT__=1 -DNDEBUG -DQT_ASCII_CAST_WARNINGS -DBUILDING_JavaScriptCore -DBUILDING_WTF -DENABLE_GLIB_SUPPORT=1 -D_LARGEFILE64_SOURCE -D_LARGEFILE_SOURCE -DQT_NO_DEBUG -DQT_CORE_LIB -DQT_SHARED -I/usr/local/share/qt4/mkspecs/freebsd-g++ -I. -I../../../../../include/QtCore -I../../../../../include -I. -I../../Source -I../ThirdParty -Iassembler -Ibytecode -Ibytecompiler -Iheap -Idfg -Idebugger -Iinterpreter -Ijit -Iparser -Iprofiler -Iruntime -Iwtf -Iwtf/gobject -I/magus/work/usr/mports/www/webkit-qt4/work/qt-everywhere-opensource-src-4.8.7/src/3rdparty/webkit/Source/JavaScriptCore/wtf/symbian -Iwtf/unicode -Iyarr -IAPI -IForwardingHeaders -Igenerated -I../../Source -I../../include -I/include/QtWebKit -I/include -I/usr/local/include/glib-2.0 -I/usr/local/lib/glib-2.0/include -I/usr/local/include -I.moc/release-static -I/usr/local/include/qt4 -I/usr/local/include wtf/qt/ThreadingQt.cpp -o .moc/release-static/ThreadingQt.moc
--- .obj/release-static/YarrInterpreter.o ---
g++6 -c -O2 -pipe -Wl,-rpath=/usr/local/lib/gcc6 -fno-strict-aliasing -Wl,-rpath=/usr/local/lib/gcc6 -I../../../../include/Qt -I../../../../include -Wall -Wextra -Wreturn-type -fno-strict-aliasing -Wcast-align -Wchar-subscripts -Wformat-security -Wreturn-type -Wno-unused-parameter -Wno-sign-compare -Wno-switch -Wno-switch-enum -Wundef -Wmissing-noreturn -Winit-self -O3 -pthread -fvisibility=hidden -fvisibility-inlines-hidden -fPIC -pthread -D_THREAD_SAFE -DNDEBUG -DBUILDING_QT__=1 -DNDEBUG -DQT_ASCII_CAST_WARNINGS -DBUILDING_JavaScriptCore -DBUILDING_WTF -DENABLE_GLIB_SUPPORT=1 -D_LARGEFILE64_SOURCE -D_LARGEFILE_SOURCE -DQT_NO_DEBUG -DQT_CORE_LIB -DQT_SHARED -I/usr/local/share/qt4/mkspecs/freebsd-g++ -I. -I../../../../../include/QtCore -I../../../../../include -I. -I../../Source -I../ThirdParty -Iassembler -Ibytecode -Ibytecompiler -Iheap -Idfg -Idebugger -Iinterpreter -Ijit -Iparser -Iprofiler -Iruntime -Iwtf -Iwtf/gobject -I/magus/work/usr/mports/www/webkit-qt4/work/qt-everywhere-opensource-src-4.8.7/src/3rdparty/webkit/Source/JavaScriptCore/wtf/symbian -Iwtf/unicode -Iyarr -IAPI -IForwardingHeaders -Igenerated -I../../Source -I../../include -I/include/QtWebKit -I/include -I/usr/local/include/glib-2.0 -I/usr/local/lib/glib-2.0/include -I/usr/local/include -I.moc/release-static -I/usr/local/include/qt4 -I/usr/local/include -o .obj/release-static/YarrInterpreter.o yarr/YarrInterpreter.cpp
--- .obj/release-static/YarrPattern.o ---
g++6 -c -O2 -pipe -Wl,-rpath=/usr/local/lib/gcc6 -fno-strict-aliasing -Wl,-rpath=/usr/local/lib/gcc6 -I../../../../include/Qt -I../../../../include -Wall -Wextra -Wreturn-type -fno-strict-aliasing -Wcast-align -Wchar-subscripts -Wformat-security -Wreturn-type -Wno-unused-parameter -Wno-sign-compare -Wno-switch -Wno-switch-enum -Wundef -Wmissing-noreturn -Winit-self -O3 -pthread -fvisibility=hidden -fvisibility-inlines-hidden -fPIC -pthread -D_THREAD_SAFE -DNDEBUG -DBUILDING_QT__=1 -DNDEBUG -DQT_ASCII_CAST_WARNINGS -DBUILDING_JavaScriptCore -DBUILDING_WTF -DENABLE_GLIB_SUPPORT=1 -D_LARGEFILE64_SOURCE -D_LARGEFILE_SOURCE -DQT_NO_DEBUG -DQT_CORE_LIB -DQT_SHARED -I/usr/local/share/qt4/mkspecs/freebsd-g++ -I. -I../../../../../include/QtCore -I../../../../../include -I. -I../../Source -I../ThirdParty -Iassembler -Ibytecode -Ibytecompiler -Iheap -Idfg -Idebugger -Iinterpreter -Ijit -Iparser -Iprofiler -Iruntime -Iwtf -Iwtf/gobject -I/magus/work/usr/mports/www/webkit-qt4/work/qt-everywhere-opensource-src-4.8.7/src/3rdparty/webkit/Source/JavaScriptCore/wtf/symbian -Iwtf/unicode -Iyarr -IAPI -IForwardingHeaders -Igenerated -I../../Source -I../../include -I/include/QtWebKit -I/include -I/usr/local/include/glib-2.0 -I/usr/local/lib/glib-2.0/include -I/usr/local/include -I.moc/release-static -I/usr/local/include/qt4 -I/usr/local/include -o .obj/release-static/YarrPattern.o yarr/YarrPattern.cpp
In file included from ./wtf/FastAllocBase.h:93:0,
                 from ./wtf/RefCounted.h:25,
                 from ./wtf/CrossThreadRefCounted.h:36,
                 from ./wtf/text/StringImpl.h:28,
                 from ./runtime/UString.h:26,
                 from yarr/YarrPattern.h:30,
                 from yarr/YarrPattern.cpp:28:
./wtf/TypeTraits.h:186:69: error: 'std::tr1' has not been declared
     template struct HasTrivialConstructor : public std::tr1::has_trivial_constructor { };
                                                                     ^~~
--- .obj/release-static/YarrInterpreter.o ---
In file included from ./wtf/FastAllocBase.h:93:0,
                 from ./wtf/RefCounted.h:25,
                 from ./wtf/CrossThreadRefCounted.h:36,
                 from ./wtf/text/StringImpl.h:28,
                 from ./runtime/UString.h:26,
                 from yarr/YarrPattern.h:30,
                 from yarr/YarrInterpreter.h:29,
                 from yarr/YarrInterpreter.cpp:28:
./wtf/TypeTraits.h:186:69: error: 'std::tr1' has not been declared
     template struct HasTrivialConstructor : public std::tr1::has_trivial_constructor { };
                                                                     ^~~
./wtf/TypeTraits.h:186:74: error: expected '{' before 'has_trivial_constructor'
     template struct HasTrivialConstructor : public std::tr1::has_trivial_constructor { };
                                                                          ^~~~~~~~~~~~~~~~~~~~~~~
./wtf/TypeTraits.h:187:68: error: 'std::tr1' has not been declared
--- .obj/release-static/YarrPattern.o ---
./wtf/TypeTraits.h:186:74: error: expected '{' before 'has_trivial_constructor'
     template struct HasTrivialConstructor : public std::tr1::has_trivial_constructor { };
                                                                          ^~~~~~~~~~~~~~~~~~~~~~~
./wtf/TypeTraits.h:187:68: error: 'std::tr1' has not been declared
     template struct HasTrivialDestructor : public std::tr1::has_trivial_destructor { };
                                                                    ^~~
./wtf/TypeTraits.h:187:73: error: expected '{' before 'has_trivial_destructor'
     template struct HasTrivialDestructor : public std::tr1::has_trivial_destructor { };
                                                                         ^~~~~~~~~~~~~~~~~~~~~~
--- .obj/release-static/YarrInterpreter.o ---
     template struct HasTrivialDestructor : public std::tr1::has_trivial_destructor { };
                                                                    ^~~
./wtf/TypeTraits.h:187:73: error: expected '{' before 'has_trivial_destructor'
     template struct HasTrivialDestructor : public std::tr1::has_trivial_destructor { };
                                                                         ^~~~~~~~~~~~~~~~~~~~~~
*** [.obj/release-static/YarrInterpreter.o] Error code 1

make[2]: stopped in /magus/work/usr/mports/www/webkit-qt4/work/qt-everywhere-opensource-src-4.8.7/src/3rdparty/webkit/Source/JavaScriptCore
--- .obj/release-static/YarrPattern.o ---
*** [.obj/release-static/YarrPattern.o] Error code 1

make[2]: stopped in /magus/work/usr/mports/www/webkit-qt4/work/qt-everywhere-opensource-src-4.8.7/src/3rdparty/webkit/Source/JavaScriptCore
2 errors

make[2]: stopped in /magus/work/usr/mports/www/webkit-qt4/work/qt-everywhere-opensource-src-4.8.7/src/3rdparty/webkit/Source/JavaScriptCore
*** [sub-JavaScriptCore-JavaScriptCore-pro-make_default-ordered] Error code 2

make[1]: stopped in /magus/work/usr/mports/www/webkit-qt4/work/qt-everywhere-opensource-src-4.8.7/src/3rdparty/webkit/Source
1 error

make[1]: stopped in /magus/work/usr/mports/www/webkit-qt4/work/qt-everywhere-opensource-src-4.8.7/src/3rdparty/webkit/Source
===> Compilation failed unexpectedly.
Try to set MAKE_JOBS_UNSAFE=yes and rebuild before reporting the failure to
the maintainer.
*** Error code 1

Stop.
make: stopped in /usr/mports/www/webkit-qt4