MidnightBSD Magus

archivers/php73-phar

The phar shared extension for php

Flavor Version Run OSVersion Arch License Restricted Status
7.3.9 391 1.1 i386 php 0 fail

Events

Machine Type Time Message
m1132 info 2019-10-15 20:53:57.478705 Test Started
m1132 fail 2019-10-15 20:54:09.944061 make build returned non-zero: 1
m1132 fail 2019-10-15 20:54:09.989756 Test complete.

Log

===>  Building for php73-phar-7.3.9
--- util.lo ---
--- tar.lo ---
--- util.lo ---
/bin/sh /magus/work/usr/mports/archivers/php73-phar/work/php-7.3.9/ext/phar/libtool --mode=compile cc -DZEND_ENABLE_STATIC_TSRMLS_CACHE=1 -I. -I/magus/work/usr/mports/archivers/php73-phar/work/php-7.3.9/ext/phar -DPHP_ATOM_INC -I/magus/work/usr/mports/archivers/php73-phar/work/php-7.3.9/ext/phar/include -I/magus/work/usr/mports/archivers/php73-phar/work/php-7.3.9/ext/phar/main -I/magus/work/usr/mports/archivers/php73-phar/work/php-7.3.9/ext/phar -I/usr/local/include/php -I/usr/local/include/php/main -I/usr/local/include/php/TSRM -I/usr/local/include/php/Zend -I/usr/local/include/php/ext -I/usr/local/include/php/ext/date/lib -I/usr/local/include  -I/usr/local/include/php -I/usr/local/include/php/main -I/usr/local/include/php/TSRM -I/usr/local/include/php/Zend -I/usr/local/include/php/ext -I/usr/local/include/php/ext/date/lib -DHAVE_CONFIG_H  -O2 -pipe -fno-strict-aliasing   -c /magus/work/usr/mports/archivers/php73-phar/work/php-7.3.9/ext/phar/util.c -o util.lo
--- tar.lo ---
/bin/sh /magus/work/usr/mports/archivers/php73-phar/work/php-7.3.9/ext/phar/libtool --mode=compile cc -DZEND_ENABLE_STATIC_TSRMLS_CACHE=1 -I. -I/magus/work/usr/mports/archivers/php73-phar/work/php-7.3.9/ext/phar -DPHP_ATOM_INC -I/magus/work/usr/mports/archivers/php73-phar/work/php-7.3.9/ext/phar/include -I/magus/work/usr/mports/archivers/php73-phar/work/php-7.3.9/ext/phar/main -I/magus/work/usr/mports/archivers/php73-phar/work/php-7.3.9/ext/phar -I/usr/local/include/php -I/usr/local/include/php/main -I/usr/local/include/php/TSRM -I/usr/local/include/php/Zend -I/usr/local/include/php/ext -I/usr/local/include/php/ext/date/lib -I/usr/local/include  -I/usr/local/include/php -I/usr/local/include/php/main -I/usr/local/include/php/TSRM -I/usr/local/include/php/Zend -I/usr/local/include/php/ext -I/usr/local/include/php/ext/date/lib -DHAVE_CONFIG_H  -O2 -pipe -fno-strict-aliasing   -c /magus/work/usr/mports/archivers/php73-phar/work/php-7.3.9/ext/phar/tar.c -o tar.lo
--- util.lo ---
mkdir .libs
--- tar.lo ---
 cc -DZEND_ENABLE_STATIC_TSRMLS_CACHE=1 -I. -I/magus/work/usr/mports/archivers/php73-phar/work/php-7.3.9/ext/phar -DPHP_ATOM_INC -I/magus/work/usr/mports/archivers/php73-phar/work/php-7.3.9/ext/phar/include -I/magus/work/usr/mports/archivers/php73-phar/work/php-7.3.9/ext/phar/main -I/magus/work/usr/mports/archivers/php73-phar/work/php-7.3.9/ext/phar -I/usr/local/include/php -I/usr/local/include/php/main -I/usr/local/include/php/TSRM -I/usr/local/include/php/Zend -I/usr/local/include/php/ext -I/usr/local/include/php/ext/date/lib -I/usr/local/include -I/usr/local/include/php -I/usr/local/include/php/main -I/usr/local/include/php/TSRM -I/usr/local/include/php/Zend -I/usr/local/include/php/ext -I/usr/local/include/php/ext/date/lib -DHAVE_CONFIG_H -O2 -pipe -fno-strict-aliasing -c /magus/work/usr/mports/archivers/php73-phar/work/php-7.3.9/ext/phar/tar.c  -fPIC -DPIC -o .libs/tar.o
--- util.lo ---
 cc -DZEND_ENABLE_STATIC_TSRMLS_CACHE=1 -I. -I/magus/work/usr/mports/archivers/php73-phar/work/php-7.3.9/ext/phar -DPHP_ATOM_INC -I/magus/work/usr/mports/archivers/php73-phar/work/php-7.3.9/ext/phar/include -I/magus/work/usr/mports/archivers/php73-phar/work/php-7.3.9/ext/phar/main -I/magus/work/usr/mports/archivers/php73-phar/work/php-7.3.9/ext/phar -I/usr/local/include/php -I/usr/local/include/php/main -I/usr/local/include/php/TSRM -I/usr/local/include/php/Zend -I/usr/local/include/php/ext -I/usr/local/include/php/ext/date/lib -I/usr/local/include -I/usr/local/include/php -I/usr/local/include/php/main -I/usr/local/include/php/TSRM -I/usr/local/include/php/Zend -I/usr/local/include/php/ext -I/usr/local/include/php/ext/date/lib -DHAVE_CONFIG_H -O2 -pipe -fno-strict-aliasing -c /magus/work/usr/mports/archivers/php73-phar/work/php-7.3.9/ext/phar/util.c  -fPIC -DPIC -o .libs/util.o
--- tar.lo ---
In file included from /magus/work/usr/mports/archivers/php73-phar/work/php-7.3.9/ext/phar/tar.c:20:
--- util.lo ---
In file included from /magus/work/usr/mports/archivers/php73-phar/work/php-7.3.9/ext/phar/util.c:21:
In file included from ./phar_internal.h:25:
In file included from /usr/local/include/php/main/php.h:33:
In file included from /usr/local/include/php/Zend/zend.h:27:
In file included from /usr/local/include/php/Zend/zend_types.h:25:
In file included from /usr/local/include/php/Zend/zend_portability.h:43:
In file included from /usr/local/include/php/Zend/zend_config.h:1:
In file included from /usr/local/include/php/main/../main/php_config.h:2664:
--- tar.lo ---
In file included from ./phar_internal.h:25:
In file included from /usr/local/include/php/main/php.h:33:
In file included from /usr/local/include/php/Zend/zend.h:27:
In file included from /usr/local/include/php/Zend/zend_types.h:25:
In file included from /usr/local/include/php/Zend/zend_portability.h:43:
In file included from /usr/local/include/php/Zend/zend_config.h:1:
In file included from /usr/local/include/php/main/../main/php_config.h:2664:
/usr/local/include/php/ext/php_config.h:1:10: fatal error: 'ext/hash/config.h' file not found
#include "ext/hash/config.h"
         ^
--- util.lo ---
/usr/local/include/php/ext/php_config.h:1:10: fatal error: 'ext/hash/config.h' file not found
#include "ext/hash/config.h"
         ^
--- tar.lo ---
1 error generated.
*** [tar.lo] Error code 1

make[1]: stopped in /magus/work/usr/mports/archivers/php73-phar/work/php-7.3.9/ext/phar
--- util.lo ---
1 error generated.
*** [util.lo] Error code 1

make[1]: stopped in /magus/work/usr/mports/archivers/php73-phar/work/php-7.3.9/ext/phar
2 errors

make[1]: stopped in /magus/work/usr/mports/archivers/php73-phar/work/php-7.3.9/ext/phar
===> Compilation failed unexpectedly.
Try to set MAKE_JOBS_UNSAFE=yes and rebuild before reporting the failure to
the maintainer.
*** Error code 1

Stop.
make: stopped in /usr/mports/archivers/php73-phar